{"text_format":"1","workbook":"xlsx","n_sheets":22,"sheets":["CAMPEONES","CAMPEONES ","AL GALOPE","SUPER CHASQUI","RANKING 2015","CAMPEONES 2015","EQUIPOS","ELITE ABIERTA","ELITE JUVENIL","ELITE MENORES","ELITE CABALLOS","AMATEUR ABIERTA","AMATEUR JUVENIL","AMATEUR MENORES","CABALLOS NOVICIOS","PR ABIERTA","PR JUVENIL","PR MENORES","PR INFANTIL","PR ADULTO-MENOR","BINOMIOS ABIERTA","BINOMIOS LIVIANOS"],"not_rendered":{"charts":0,"images":0,"macros":1,"external_links":0,"defined_names":148,"comments":0,"pivot_tables":0},"unopened":[],"bounds":{"document_bytes":16777216,"sheet_cells":100000,"rows_first":2000,"rows_last":500,"rows_between":2000,"halvings":0,"cell_chars":16384,"cell_head_chars":4096},"cells_cut":0,"cells_raw":0,"read":"whole","date_system":"1900"}

{"sheet":"CAMPEONES","index":0,"n_rows":79,"n_cols":11,"rows_kept":79,"cut":false,"hidden":true,"merged":[[1,0,1,10],[2,5,2,10],[7,0,7,3],[19,0,19,3],[25,0,25,3],[68,0,68,2],[13,0,13,3],[74,0,74,2],[37,0,37,3],[43,0,43,3],[49,0,49,2],[55,0,55,2],[61,0,61,2],[31,0,31,3]]}
[]
["CAMPEONATO DE EQUIPOS                                        "]
[null,null,"EQUIPO","CAPITAN","PUNTAJE","               JINETES"]
[1,"CAMPEÓN NACIONAL","CEPSA AMAROK","FELIPE PORTILLA",1628.8969999999999,"RIBADENEIRA SOFIA","RIBADENEIRA ARTURO","CANDO MARIO","URIBE  CARLOS JOSE","PORTILLA FELIPE","QUIROZ ORLANDO"]
[2,"VICECAMPEÓN NACIONAL","EKOS NEGOCIOS.COM 1","MAURICIO MURILLO",1604.299,"RICARDO DUEÑAS","MORILLO MAURICIO","RUIZ ILIANA","SERGIO MORILLO","BRAUER MARIA FERNANDA"]
[3,null,"EQUINOCCIAL 1","BERNARDO DARQUEA",1349.7159999999999,"JUAN JOSE RECALDE","RAFAELLA DARQUEA","BERNARDO DARQUEA","KARINA NEUMANN","DELGADO JUAN","ANDRES DARQUEA"]
[]
["CAMPEONATO NACIONAL DE JINETES ABIERTA (CHASQUI II)           "]
[null,null,"EQUIPO","PUNTAJE"]
[1,"CAMPEÓN NACIONAL","MORILLO MAURICIO",779.37159999999994]
{"$rows_left_out":70}
{"sheet":"CAMPEONES ","index":1,"n_rows":104,"n_cols":12,"rows_kept":104,"cut":false,"hidden":true,"merged":[[17,1,17,4],[33,6,33,9],[49,6,49,9],[65,6,65,9],[57,6,57,10],[25,1,25,4],[25,6,25,10],[73,6,73,10],[97,6,97,10],[17,6,17,9],[41,6,41,9],[81,6,81,9],[89,6,89,9],[1,1,1,4],[3,1,3,4],[9,1,9,4],[3,6,3,16],[4,11,4,16],[9,6,9,9],[1,6,1,16]]}
[]
[null,"CAMPEONATO ECUATORIANO DE ENDURANCE",null,null,null,null,"                                                    CAMPEONATO NACIONAL DE ENDURANCE ECUADOR"]
[]
[null,"CATEGORÍA ELITE ABIERTA  CHASQUI 2",null,null,null,null,"CAMPEONATO DE EQUIPOS                                        "]
[null,null,null,"JINETE","CABALLO",null,null,null,"EQUIPO","CAPITAN","PUNTAJE","               JINETES"]
[null,1,"CAMPEÓN NACIONAL",null,null,null,1,"CAMPEÓN NACIONAL"]
[null,2,"VICECAMPEÓN NACIONAL",null,null,null,2,"VICECAMPEÓN NACIONAL"]
[null,3,null,null,null,null,3]
[]
[null,"CATEGORÍA ELITE JUVENIL  CHASQUI 2",null,null,null,null,"CATEGORÍA ELITE ABIERTA        "]
{"$rows_left_out":95}
{"sheet":"AL GALOPE","index":2,"n_rows":23,"n_cols":11,"rows_kept":23,"cut":false,"hidden":true,"merged":[[4,4,4,8],[3,4,3,8],[1,1,1,11],[6,3,6,5],[7,3,7,5],[6,7,6,9],[7,7,7,9],[9,10,9,11],[10,10,10,11],[12,1,12,2],[12,4,12,5],[12,7,12,8],[12,10,12,11],[10,1,10,2],[9,1,9,2],[9,4,9,5],[10,4,10,5],[9,7,9,8],[10,7,10,8],[16,1,16,2],[16,4,16,5],[16,7,16,8],[16,10,16,11],[13,1,13,2],[13,4,13,5],[13,7,13,8],[13,10,13,11],[15,1,15,2],[15,4,15,5],[15,7,15,8],[15,10,15,11],[18,1,18,2],[19,1,19,2],[18,4,18,5],[19,4,19,5],[18,7,18,8],[19,7,19,8],[18,10,18,11],[19,10,19,11],[21,3,21,5],[22,3,22,5],[21,7,21,9],[22,7,22,9]]}
[]
[null,"                                               AL GALOPE:             CAMPEONATO  DE ENDURANCE ECUADOR 2015"]
[]
[null,null,null,null,"EQUIPO AL GALOPE TRICAMPEÓN NACIONAL "]
[null,null,null,null,"EQUIPO AL GALOPE 1 TERCER LUGAR"]
[]
[null,null,null,"PABLO VINTIMILLA & BIANCA",null,null,null,"MARÍA CONSUELO VELEZ & KAFIR HA"]
[null,null,null,"VICECAMPEONES NACIONALES DE ENDURANCE",null,null,null,"TERCEROS EN CAMPEONATO NACIONAL"]
[]
[null,"JOSÉ DANIEL ANDRADE",null,null,"BERNARDA GONZÁLEZ",null,null,"JAIME BURBANO VILLAVICENCIO",null,null,"HECTOR ALMEIDA & CENTAURO"]
{"$rows_left_out":14}
{"sheet":"SUPER CHASQUI","index":3,"n_rows":108,"n_cols":5,"rows_kept":108,"cut":false,"hidden":false,"merged":[[1,2,1,4],[36,1,36,3],[42,1,42,3],[65,1,65,4],[93,1,93,4],[3,1,3,3],[9,1,9,3],[15,1,15,3],[21,1,21,3],[30,1,30,3]]}
[]
[null,null,"PREMIO SUPER CHASQUI DE ENDURANCE"]
[]
[null,"SUPER CHASQUI 3 JINETES"]
[null,null,"JINETE"]
[null,1]
[null,2]
[null,3]
[]
[null,"SUPER CHASQUI 3 CABALLOS"]
{"$rows_left_out":99}
{"sheet":"RANKING 2015","index":4,"n_rows":124,"n_cols":11,"rows_kept":124,"cut":false,"hidden":false,"merged":[[0,0,0,10],[109,0,109,3],[69,0,69,4],[8,0,8,3],[16,0,16,3],[28,0,28,4],[52,0,52,3],[60,0,60,4],[36,0,36,3],[44,0,44,3],[24,0,24,3],[77,0,77,4],[85,0,85,3],[93,0,93,3],[101,0,101,3],[3,5,3,10],[2,0,2,10],[117,0,117,4]]}
["                                                  RANKING NACIONAL DE ENDURANCE ECUADOR 2015"]
[]
["CAMPEONATO DE EQUIPOS                                        "]
[null,null,"EQUIPO","CAPITAN","PUNTAJE","               JINETES"]
[1,"CAMPEÓN NACIONAL",{"$f":"+EQUIPOS!C8","v":"AL GALOPE"},{"$f":"+EQUIPOS!D8","v":"HECTOR ALMEIDA AYALA "},{"$f":"+EQUIPOS!U8","v":2483.067},{"$f":"+EQUIPOS!E8","v":"BERNARDA GONZÁLEZ"},{"$f":"+EQUIPOS!F8","v":"MARÍA CLAUDIA LOYOLA"},{"$f":"+EQUIPOS!G8","v":"MAURICIO NOBOA"},{"$f":"+EQUIPOS!H8","v":"ANDRADE JOSE DANIEL"},{"$f":"+EQUIPOS!I8","v":"ALMEIDA AYALA HECTOR"},{"$f":"+EQUIPOS!J8","v":"ALEXANDER GÓMEZ"}]
[2,"VICECAMPEÓN NACIONAL",{"$f":"+EQUIPOS!C9","v":"SELECT ECUADOR 1"},{"$f":"+EQUIPOS!D9","v":"JOSÉ LETORT"},{"$f":"+EQUIPOS!U9","v":2074.3739999999998},{"$f":"+EQUIPOS!E9","v":"LETORT DUEÑAS JOSE IGNACIO"},{"$f":"+EQUIPOS!F9","v":"SERRANO ARMANDO JOSE"},{"$f":"+EQUIPOS!G9","v":"BERNARDA LETORT"},{"$f":"+EQUIPOS!H9","v":"JOSÉ LETORT"},{"$f":"+EQUIPOS!I9","v":"MANUELA JARAMILLO"},{"$f":"+EQUIPOS!J9","v":"BENITO JOSÉ JARAMILLO"}]
[3,null,{"$f":"+EQUIPOS!C10","v":"AL GALOPE 1"},{"$f":"+EQUIPOS!D10","v":"OSWALDO KOPPEL"},{"$f":"+EQUIPOS!U10","v":2070.232},{"$f":"+EQUIPOS!E10","v":"MALO TORAL DAVID"},{"$f":"+EQUIPOS!F10","v":"VINTIMILLA SERRANO PABLO XAVIER"},{"$f":"+EQUIPOS!G10","v":"VELEZ MENA MARIA CONSUELO"},{"$f":"+EQUIPOS!H10","v":"BURBANO JAIME"},{"$f":"+EQUIPOS!I10","v":"OSWALDO KOPPEL"},{"$f":"+EQUIPOS!J10","v":"HÉCTOR ALMEIDA PARDO"}]
[]
["CATEGORÍA ELITE ABIERTA        "]
[null,null,"JINETE","PUNTAJE"]
{"$rows_left_out":115}
{"sheet":"CAMPEONES 2015","index":5,"n_rows":38,"n_cols":5,"rows_kept":38,"cut":false,"hidden":false,"merged":[[1,1,1,4],[3,1,3,4],[27,1,27,4],[33,1,33,4],[9,1,9,4],[15,1,15,4],[21,1,21,4]]}
[]
[null,"CAMPEONATO ECUATORIANO DE ENDURANCE"]
[]
[null,"CATEGORÍA ELITE ABIERTA  CHASQUI 3"]
[null,null,null,"JINETE","CABALLO"]
[null,1,"CAMPEÓN NACIONAL","RIBADENEIRA ARTURO","ANGOSTURA FRODO"]
[null,2,"VICECAMPEÓN NACIONAL","VINTIMILLA PABLO","BIANCA"]
[null,3,null,"VELEZ MENA MARIA CONSUELO","KAFIR HA"]
[]
[null,"CATEGORÍA ELITE JUVENIL  CHASQUI 3"]
{"$rows_left_out":29}
{"sheet":"EQUIPOS","index":6,"n_rows":23,"n_cols":41,"rows_kept":23,"cut":false,"hidden":false,"merged":[[1,1,1,20],[6,4,6,9],[4,1,4,9],[4,10,4,20],[5,10,5,20],[2,1,2,20]]}
[]
[null,"                                                      PUNTAJE  ACUMULADO"]
[null,"                                                                   EQUIPOS"]
[]
[null,"EQUIPOS",null,null,null,null,null,null,null,null,"PUNTAJES"]
[null,null,null,null,null,null,null,null,null,null,2012]
[null,null,"EQUIPO","CAPITAN","               JINETES",null,null,null,null,null,"I CHONE","II CHONE","III CHONE","IV CHONE","V CHONE","VI CHONE","VII CHONE","VIII CHONE","IX CHONE","X CHONE","ACUMULADO"]
[null,1,"AL GALOPE","HECTOR ALMEIDA AYALA ","BERNARDA GONZÁLEZ","MARÍA CLAUDIA LOYOLA","MAURICIO NOBOA","ANDRADE JOSE DANIEL","ALMEIDA AYALA HECTOR","ALEXANDER GÓMEZ",418.4,null,null,624,572.22699999999998,478.5,null,null,389.94,null,{"$f":"SUM(K8:T8)","v":2483.067}]
[null,2,"SELECT ECUADOR 1","JOSÉ LETORT","LETORT DUEÑAS JOSE IGNACIO","SERRANO ARMANDO JOSE","BERNARDA LETORT","JOSÉ LETORT","MANUELA JARAMILLO","BENITO JOSÉ JARAMILLO",null,393.96,null,null,405.88599999999997,null,329.15800000000002,null,466.32,479.04999999999995,2074.3739999999998]
[null,3,"AL GALOPE 1","OSWALDO KOPPEL","MALO TORAL DAVID","VINTIMILLA SERRANO PABLO XAVIER","VELEZ MENA MARIA CONSUELO","BURBANO JAIME","OSWALDO KOPPEL","HÉCTOR ALMEIDA PARDO",null,412.452,null,576,null,486.75000000000006,null,null,null,595.03,2070.232,null,null,null,null,null,null,null,null,null,null,null,null,null,null,null,null,null,null,{"$f":"+$U$8-U9","v":408.69300000000021},{"$f":"VLOOKUP(B10,#REF!,3,FALSE)","v":{"$error":"#REF!"}}]
{"$rows_left_out":14}
{"sheet":"ELITE ABIERTA","index":7,"n_rows":50,"n_cols":15,"rows_kept":50,"cut":false,"hidden":false,"merged":[[5,4,5,14],[4,1,4,3],[4,4,4,14],[1,1,1,14],[2,1,2,14]]}
[]
[null,"PUNTAJE  ACUMULADO"]
[null,"CATEGORÍA ABIERTA ELITE"]
[]
[null,"ELITE ABIERTA",null,null,"PUNTAJES"]
[null,null,null,null,2014]
[null,null,"CODIGO","JINETE","I CHONE","II CHONE","III CHONE","IV CHONE","V CHONE","VI CHONE","VII CHONE","VIII CHONE","IX CHONE","X CHONE","ACUMULADO"]
[null,1,"A058","RIBADENEIRA ARTURO",null,160.80000000000001,240,159.6,163.1,null,null,null,136.68,241.6,{"$f":"SUM(E8:N8)","v":1101.78}]
[null,2,"A045","VINTIMILLA PABLO",null,null,null,240,null,156.75,null,165,144.72,229.51999999999998,935.99]
[null,3,"A092","MORABOWEN CESAR",152,null,170,null,154.94499999999999,null,145.476,null,152.76,null,775.18100000000004]
{"$rows_left_out":41}
{"sheet":"ELITE JUVENIL","index":8,"n_rows":39,"n_cols":15,"rows_kept":39,"cut":false,"hidden":false,"merged":[[5,4,5,14],[4,1,4,3],[4,4,4,14],[1,1,1,14],[2,1,2,14]]}
[]
[null,"PUNTAJE  ACUMULADO"]
[null,"CATEGORÍA JUVENIL ELITE"]
[]
[null,"ELITE JUVENIL",null,null,"PUNTAJES"]
[null,null,null,null,2014]
[null,null,"CODIGO","JINETE","I CHONE","II CHONE","III CHONE","IV CHONE","V CHONE","VI CHONE","VII CHONE","VIII CHONE","IX CHONE","X CHONE","ACUMULADO"]
[null,1,"J034","ANDRADE JOSE DANIEL",160,160.80000000000001,240,null,null,165,161.63999999999999,90,160.80000000000001,null,{"$f":"SUM(E8:N8)","v":1138.24}]
[null,2,"J063","GONZALEZ BERNARDA",106.39999999999999,null,228,null,219.43799999999999,165,null,null,null,null,718.83799999999997]
[null,3,"J047","LETORT DUEÑAS JOSE IGNACIO",null,null,161.5,null,163.1,null,null,null,160.80000000000001,174.2,659.6]
{"$rows_left_out":30}
{"sheet":"ELITE MENORES","index":9,"n_rows":39,"n_cols":15,"rows_kept":39,"cut":false,"hidden":false,"merged":[[1,1,1,14],[2,1,2,14],[4,1,4,3],[4,4,4,14],[5,4,5,14]]}
[]
[null,"PUNTAJE  ACUMULADO"]
[null,"CATEGORÍA MENORES ELITE"]
[]
[null,"ELITE MENORES",null,null,"PUNTAJES"]
[null,null,null,null,2014]
[null,null,"CODIGO","JINETE","I CHONE","II CHONE","III CHONE","IV CHONE","V CHONE","VI CHONE","VII CHONE","VIII CHONE","IX CHONE","X CHONE","ACUMULADO"]
[null,1,"M013","JARAMILLO BENITO",null,112.56,null,null,163.1,null,87.800000000000011,null,160.80000000000001,null,{"$f":"SUM(E8:N8)","v":524.26}]
[null,2,null,null,null,null,null,null,null,null,null,null,null,null,0]
[null,3,null,null,null,null,null,null,null,null,null,null,null,null,0]
{"$rows_left_out":30}
{"sheet":"ELITE CABALLOS","index":10,"n_rows":80,"n_cols":16,"rows_kept":80,"cut":false,"hidden":false,"merged":[[5,5,5,15],[4,5,4,15],[1,1,1,15],[2,1,2,15],[4,1,4,4]]}
[]
[null,"PUNTAJE  ACUMULADO"]
[null,"CATEGORÍA CABALLOS ELITE"]
[]
[null,"ELITE CABALLOS",null,null,null,"PUNTAJES"]
[null,null,null,null,null,2014]
[null,null,"CODIGO","CABALLO","DUEÑO/JINETE","I CHONE","II CHONE","III CHONE","IV CHONE","V CHONE","VI CHONE","VII CHONE","VIII CHONE","IX CHONE","X CHONE","ACUMULADO"]
[null,1,"C188","FRODO","ARTURO RIBADENEIRA",null,null,240,null,null,null,null,null,120.6,241.6,{"$f":"SUM(F8:O8)","v":602.20000000000005}]
[null,2,"C202","PV RIGUEL","PABLO VINTIMILLA",null,null,161.5,240,null,156.75,null,null,null,null,{"$f":"SUM(F9:O9)","v":558.25}]
[null,3,"C174","ZT SATFANTDU","ARTURO RIBADENEIRA",null,112.56,null,159.6,83.88,null,145.476,null,80.400000000000006,241.6,{"$f":"+O10+I10+L10","v":546.67599999999993}]
{"$rows_left_out":71}
{"sheet":"AMATEUR ABIERTA","index":11,"n_rows":94,"n_cols":15,"rows_kept":94,"cut":false,"hidden":false,"merged":[[5,4,5,14],[4,1,4,3],[4,4,4,14],[1,1,1,14],[2,1,2,14]]}
[]
[null,"PUNTAJE  ACUMULADO"]
[null,"CATEGORÍA ABIERTA NOVICIOS"]
[]
[null,"NOVICIOS ABIERTA",null,null,"PUNTAJES"]
[null,null,null,null,2014]
[null,null,"CODIGO","JINETE","I CHONE","II CHONE","III CHONE","IV CHONE","V CHONE","VI CHONE","VII CHONE","VIII CHONE","IX CHONE","X CHONE","ACUMULADO"]
[null,1,"A137","ESPINOZA JUAN SEBASTIAN",96.6,null,null,null,null,156.75,null,165,null,174.2,{"$f":"SUM(E8:N8)","v":592.54999999999995}]
[null,2,"A125","FALCONI FRANCISCO",null,null,77.039999999999992,null,75.492000000000004,null,null,null,114.57,122.4,389.50199999999995]
[null,3,"A021","ALVEAR JUAN CARLOS",null,null,null,null,null,null,145.476,null,76.38,86.800000000000011,308.65600000000001]
{"$rows_left_out":85}
{"sheet":"AMATEUR JUVENIL","index":12,"n_rows":83,"n_cols":15,"rows_kept":83,"cut":false,"hidden":false,"merged":[[5,4,5,14],[4,1,4,3],[4,4,4,14],[1,1,1,14],[2,1,2,14]]}
[]
[null,"PUNTAJE  ACUMULADO"]
[null,"CATEGORÍA JUVENIL NOVICIOS"]
[]
[null,"NOVICIOS JUVENIL",null,null,"PUNTAJES"]
[null,null,null,null,2014]
[null,null,"CODIGO","JINETE","I CHONE","II CHONE","III CHONE","IV CHONE","V CHONE","VI CHONE","VII CHONE","VIII CHONE","IX CHONE","X CHONE","ACUMULADO"]
[null,1,"J100","MASAPANTA KEVIN",null,null,null,null,163.1,null,null,null,80.400000000000006,null,{"$f":"SUM(E8:N8)","v":243.5}]
[null,2,"J099","DARQUEA ANA MARIA",null,null,null,91.199999999999989,83.88,null,null,null,null,null,{"$f":"SUM(E9:N9)","v":175.07999999999998}]
[null,3,"J096","HURTADO HECTOR",51.519999999999996,null,null,null,null,null,null,120,null,null,{"$f":"SUM(E10:N10)","v":171.51999999999998}]
{"$rows_left_out":74}
{"sheet":"AMATEUR MENORES","index":13,"n_rows":50,"n_cols":15,"rows_kept":50,"cut":false,"hidden":false,"merged":[[5,4,5,14],[4,1,4,3],[4,4,4,14],[1,1,1,14],[2,1,2,14]]}
[]
[null,"PUNTAJE  ACUMULADO"]
[null,"CATEGORÍA MENORES NOVICIOS"]
[]
[null,"INFANTIL",null,null,"PUNTAJES"]
[null,null,null,null,2014]
[null,null,"CODIGO","JINETE","I CHONE","II CHONE","III CHONE","IV CHONE","V CHONE","VI CHONE","VII CHONE","VIII CHONE","IX CHONE","X CHONE","ACUMULADO"]
[null,1,"M042","TORRES UGALDE RAFAEL ESTEBAN",61.179999999999986,null,null,76.800000000000011,null,null,null,85.5,null,null,{"$f":"SUM(E8:N8)","v":223.48}]
[null,2,"M039","TORRES GIORDANO ALEJANDRO",null,null,null,91.199999999999989,null,null,null,90,null,null,181.2]
[null,3,"M022","MORABOWEN MOSQUERA CESAR",null,null,null,null,79.685999999999993,null,null,null,null,86.800000000000011,166.48599999999999]
{"$rows_left_out":41}
{"sheet":"CABALLOS NOVICIOS","index":14,"n_rows":117,"n_cols":16,"rows_kept":117,"cut":false,"hidden":false,"merged":[[5,5,5,15],[4,1,4,4],[4,5,4,15],[1,1,1,15],[2,1,2,15]]}
[]
[null,"PUNTAJE  ACUMULADO"]
[null,"CATEGORÍA CABALLOS NOVICIOS"]
[]
[null,"ELITE CABALLOS",null,null,null,"PUNTAJES"]
[null,null,null,null,null,2014]
[null,null,"CODIGO","CABALLO","DUEÑO/JINETE","I CHONE","II CHONE","III CHONE","IV CHONE","V CHONE","VI CHONE","VII CHONE","VIII CHONE","IX CHONE","X CHONE","ACUMULADO"]
[null,1,"C397","KALA","ESPINOZA JUAN SEBASTIAN",96.6,null,null,null,null,156.75,null,165,null,174.2,{"$f":"SUM(F8:O8)","v":592.54999999999995}]
[null,2,"C206","AS GITANA","RAMIREZ FABRICIO",null,null,72.759999999999991,null,71.297999999999988,null,153.55799999999999,null,128.63999999999999,null,426.25599999999997]
[null,3,"C371","CARRUZO","SAMPER ALVARO",null,null,null,null,null,null,161.63999999999999,null,144.72,null,306.36]
{"$rows_left_out":108}
{"sheet":"PR ABIERTA","index":15,"n_rows":55,"n_cols":15,"rows_kept":55,"cut":false,"hidden":false,"merged":[[1,1,1,14],[2,1,2,14],[4,1,4,3],[4,4,4,14],[5,4,5,14]]}
[]
[null,"PUNTAJE  ACUMULADO"]
[null,"CATEGORÍA PROMOCIONAL ABIERTA"]
[]
[null,"PROMOCIONAL ABIERTA",null,null,"PUNTAJES"]
[null,null,null,null,2014]
[null,null,"CODIGO","JINETE","I CHONE","II CHONE","III CHONE","IV CHONE","V CHONE","VI CHONE","VII CHONE","VIII CHONE","IX CHONE","X CHONE","ACUMULADO"]
[null,1,"A064","CASTILLO DIEGO",null,null,85.6,null,83.88,null,79.02000000000001,null,80.400000000000006,null,{"$f":"SUM(E8:N8)","v":328.9}]
[null,2,"A012","ALMEIDA PARDO HECTOR",null,null,null,null,null,null,83.410000000000011,null,null,78.120000000000019,161.53000000000003]
[null,3,"A214","LEPPERT MISHELL",null,null,null,null,null,null,74.63000000000001,null,68.34,null,142.97000000000003]
{"$rows_left_out":46}
{"sheet":"PR JUVENIL","index":16,"n_rows":50,"n_cols":15,"rows_kept":50,"cut":false,"hidden":false,"merged":[[1,1,1,14],[2,1,2,14],[4,1,4,3],[4,4,4,14],[5,4,5,14]]}
[]
[null,"PUNTAJE  ACUMULADO"]
[null,"CATEGORÍA PROMOCIONAL JUVENIL"]
[]
[null,"PROMOCIONAL JUVENIL",null,null,"PUNTAJES"]
[null,null,null,null,2014]
[null,null,"CODIGO","JINETE","I CHONE","II CHONE","III CHONE","IV CHONE","V CHONE","VI CHONE","VII CHONE","VIII CHONE","IX CHONE","X CHONE","ACUMULADO"]
[null,1,"J104","AYMARA  LEON SANDRO",null,null,42.8,null,83.88,null,null,null,null,48.64,{"$f":"SUM(E8:N8)","v":175.32}]
[null,2,"J111","BEATE VARGAS PEDRO",null,null,null,null,null,null,87.800000000000011,null,null,86.800000000000011,174.60000000000002]
[null,3,"J110","NAVARRETE RUIZ BRAYAN",null,null,null,null,41.94,null,80.400000000000006,null,null,null,122.34]
{"$rows_left_out":41}
{"sheet":"PR MENORES","index":17,"n_rows":50,"n_cols":15,"rows_kept":50,"cut":false,"hidden":false,"merged":[[1,1,1,14],[2,1,2,14],[4,1,4,3],[4,4,4,14],[5,4,5,14]]}
[]
[null,"PUNTAJE  ACUMULADO"]
[null,"CATEGORÍA PROMOCIONAL MENORES"]
[]
[null,"PROMOCIONAL MENORES",null,null,"PUNTAJES"]
[null,null,null,null,2014]
[null,null,"CODIGO","JINETE","I CHONE","II CHONE","III CHONE","IV CHONE","V CHONE","VI CHONE","VII CHONE","VIII CHONE","IX CHONE","X CHONE","ACUMULADO"]
[null,1,"M034","BEATE VARGAS MANUELA",null,null,null,null,null,null,87.800000000000011,null,null,86.800000000000011,{"$f":"SUM(E8:N8)","v":174.60000000000002}]
[null,2,"M028","CORREA JUAN MARTIN",null,null,null,null,83.88,null,null,null,null,51.2,{"$f":"SUM(E9:N9)","v":135.07999999999998}]
[null,3,"M042","TAPIA RUBEN",null,null,null,48,null,null,null,null,null,null,{"$f":"SUM(E10:N10)","v":48}]
{"$rows_left_out":41}
{"sheet":"PR INFANTIL","index":18,"n_rows":50,"n_cols":15,"rows_kept":50,"cut":false,"hidden":false,"merged":[[1,1,1,14],[2,1,2,14],[4,1,4,3],[4,4,4,14],[5,4,5,14]]}
[]
[null,"PUNTAJE  ACUMULADO"]
[null,"CATEGORÍA PROMOCIONAL INFANTIL"]
[]
[null,"PROMOCIONAL INFANTIL",null,null,"PUNTAJES"]
[null,null,null,null,2014]
[null,null,"CODIGO","JINETE","I CHONE","II CHONE","III CHONE","IV CHONE","V CHONE","VI CHONE","VII CHONE","VIII CHONE","IX CHONE","X CHONE","ACUMULADO"]
[null,1,"M017","JARAMILLO SAMUEL",null,28.14,null,null,83.88,null,41.2,null,40.200000000000003,null,{"$f":"SUM(E8:N8)","v":193.42000000000002}]
[null,2,"I043","DONOSO JULIAN",null,null,null,48,null,45,null,null,null,null,{"$f":"SUM(E9:N9)","v":93}]
[null,3,"I031","SALTIVERI ALEJANDRA",null,null,null,null,null,null,null,null,null,51.2,{"$f":"SUM(E10:N10)","v":51.2}]
{"$rows_left_out":41}
{"sheet":"PR ADULTO-MENOR","index":19,"n_rows":165,"n_cols":15,"rows_kept":165,"cut":false,"hidden":false,"merged":[[1,1,1,14],[2,1,2,14],[4,1,4,2],[4,4,4,14],[5,4,5,14]]}
[]
[null,"PUNTAJE  ACUMULADO"]
[null,"CATEGORÍA PROMOCIONAL ADULTO/MENOR"]
[]
[null,"BINOMIOS ABIERTA",null,null,"PUNTAJES"]
[null,null,null,null,2014]
[null,null,"MENOR","ADULTOS","I CHONE","II CHONE","III CHONE","IV CHONE","V CHONE","VI CHONE","VII CHONE","VIII CHONE","IX CHONE","X CHONE","ACUMULADO"]
[null,1,"RAMIREZ RAFAEL","MORENO GABRIEL, RAMIREZ FABRICIO",null,28.14,42.8,null,41.94,null,null,null,36.180000000000007,null,{"$f":"SUM(E8:N8)","v":149.06}]
[null,4,"DARQUEA APOLO EMILIO","MASAPANTA FABIAN, DARQUEA BERNARDO, DARQUEA RAFAELA",null,25.326000000000001,40.659999999999997,null,null,null,null,null,40.200000000000003,null,{"$f":"SUM(E9:N9)","v":106.18599999999999}]
[null,2,"BARAHONA MARIA EMILIA","BARAHONA ANDRES",null,null,null,null,null,null,41.2,null,null,48.64,{"$f":"SUM(E10:N10)","v":89.84}]
{"$rows_left_out":156}
{"sheet":"BINOMIOS ABIERTA","index":20,"n_rows":165,"n_cols":17,"rows_kept":165,"cut":false,"hidden":false,"merged":[[1,1,1,16],[2,1,2,16],[4,1,4,3],[4,6,4,16],[5,6,5,16]]}
[]
[null,"PUNTAJE  ACUMULADO"]
[null,"CATEGORÍA BINOMIOS ABIERTA"]
[]
[null,"BINOMIOS ABIERTA",null,null,null,null,"PUNTAJES"]
[null,null,null,null,null,null,2014]
[null,null,"CODIGO","JINETE","CODIGO","CABALLO","I CHONE","II CHONE","III CHONE","IV CHONE","V CHONE","VI CHONE","VII CHONE","VIII CHONE","IX CHONE","X CHONE","ACUMULADO"]
[null,1,"A045","MORABOWEN CESAR","C329","SERENATA CMB",152,null,170,null,154.94499999999999,null,145.476,null,152.76,null,{"$f":"+O8+K8+I8+G8","v":629.70499999999993}]
[null,2,"A035","PORTILLA FELIPE","C204","AR ALBATSYN",null,101.304,170,null,null,null,161.63999999999999,null,120.60000000000001,165.48999999999998,{"$f":"SUM(I9:P9)","v":617.73}]
[null,3,"A137","ESPINOZA JUAN SEBASTIAN","C397","KALA",96.6,null,null,null,null,156.75,null,165,null,174.2,{"$f":"SUM(G10:P10)","v":592.54999999999995}]
{"$rows_left_out":156}
{"sheet":"BINOMIOS LIVIANOS","index":21,"n_rows":165,"n_cols":17,"rows_kept":165,"cut":false,"hidden":false,"merged":[[1,1,1,16],[2,1,2,16],[4,1,4,3],[4,6,4,16],[5,6,5,16]]}
[]
[null,"PUNTAJE  ACUMULADO"]
[null,"CATEGORÍA BINOMIOS LIVIANOS"]
[]
[null,"BINOMIOS LIVIANOS",null,null,null,null,"PUNTAJES"]
[null,null,null,null,null,null,2014]
[null,null,"CODIGO","JINETE","CODIGO","CABALLO","I CHONE","II CHONE","III CHONE","IV CHONE","V CHONE","VI CHONE","VII CHONE","VIII CHONE","IX CHONE","X CHONE","ACUMULADO"]
[null,1,"J047","LETORT DUEÑAS JOSE IGNACIO","C154","SHAKIRA",null,null,161.5,null,163.1,null,null,null,160.80000000000001,174.2,{"$f":"SUM(I8:P8)","v":659.6}]
[null,2,"A097","LETORT DUEÑAS BERNARDA","C046","AMARETO",null,144.72000000000003,null,null,null,null,87.800000000000011,null,144.72000000000003,165.48999999999998,{"$f":"SUM(G9:P9)","v":542.73}]
[null,3,"J034","ANDRADE JOSE DANIEL","C134","JUPITER",null,160.80000000000001,null,null,null,165,161.63999999999999,null,null,null,487.44]
{"$rows_left_out":155}