{"text_format":"1","workbook":"xlsx","n_sheets":20,"sheets":["RANKING 2016","CAMPEONES 2016","SUPER CHASQUI","EQUIPOS","ELITE ABIERTA","ELITE JUVENIL","ELITE MENORES","ELITE CABALLOS","AMATEUR ABIERTA","AMATEUR JUVENIL","AMATEUR MENORES","CABALLOS NOVICIOS","BINOMIOS ABIERTA","BINOMIOS LIVIANOS","PR MASTER","PR ABIERTA","PR JUVENIL","PR MENORES","PR INFANTIL","PR ADULTO-MENOR"],"not_rendered":{"charts":0,"images":0,"macros":1,"external_links":0,"defined_names":137,"comments":0,"pivot_tables":0},"unopened":[],"bounds":{"document_bytes":16777216,"sheet_cells":100000,"rows_first":2000,"rows_last":500,"rows_between":2000,"halvings":0,"cell_chars":16384,"cell_head_chars":4096},"cells_cut":0,"cells_raw":0,"read":"whole","date_system":"1900"}

{"sheet":"RANKING 2016","index":0,"n_rows":123,"n_cols":11,"rows_kept":123,"cut":false,"hidden":false,"merged":[[116,0,116,3],[3,5,3,10],[2,0,2,10],[0,0,0,10],[108,0,108,3],[36,0,36,4],[8,0,8,3],[16,0,16,3],[28,0,28,4],[68,0,68,3],[76,0,76,4],[52,0,52,3],[60,0,60,3],[24,0,24,3],[44,0,44,4],[84,0,84,3],[92,0,92,3],[100,0,100,3]]}
["                                                  RANKING NACIONAL DE ENDURANCE ECUADOR 2015"]
[]
["CAMPEONATO DE EQUIPOS                                        "]
[null,null,"EQUIPO","CAPITAN","PUNTAJE","               JINETES"]
[1,"CAMPEÓN NACIONAL",{"$f":"+EQUIPOS!C8","v":"ENDURANCE AZUAY"},{"$f":"+EQUIPOS!D8","v":"MARIA CONSUELO VELEZ "},{"$f":"+EQUIPOS!U8","v":2793.55},{"$f":"+EQUIPOS!E8","v":"PABLO VINTIMILLA"},{"$f":"+EQUIPOS!F8","v":"BERNARDA GONZALEZ"},{"$f":"+EQUIPOS!G8","v":"CLAUDIA LOYOLA"},{"$f":"+EQUIPOS!H8","v":"HECTOR ALMEIDA"},{"$f":"+EQUIPOS!I8","v":"JAIME BURBANO"},{"$f":"+EQUIPOS!J8","v":"MARIA CONSUELO VELEZ "}]
[2,"VICECAMPEÓN NACIONAL",{"$f":"+EQUIPOS!C9","v":"HACIENDA HATO VERDE"},{"$f":"+EQUIPOS!D9","v":"CESAR MORABOWEN AGUIRRE "},{"$f":"+EQUIPOS!U9","v":2246.8000000000002},{"$f":"+EQUIPOS!E9","v":"CESAR MORABOWEN MOSQUERA"},{"$f":"+EQUIPOS!F9","v":"JUAN ANTONIO LEON"},{"$f":"+EQUIPOS!G9","v":"JORGE DAVALOS"},{"$f":"+EQUIPOS!H9","v":"FABRICIO RAMIREZ"},{"$f":"+EQUIPOS!I9","v":"CESAR MORABOWEN AGUIRRE "},{"$f":"+EQUIPOS!J9","v":"MAHNKE LIESEL"}]
[3,null,{"$f":"+EQUIPOS!C10","v":"CACHAFAZ-SAN ALFONZO"},{"$f":"+EQUIPOS!D10","v":"ARTURO RIBADENEIRA "},{"$f":"+EQUIPOS!U10","v":824.07999999999993},{"$f":"+EQUIPOS!E10","v":"JOAQUINA DAVALOS"},{"$f":"+EQUIPOS!F10","v":"FRANCISCO FALCONÍ"},{"$f":"+EQUIPOS!G10","v":"FELIPE PORTILLA"},{"$f":"+EQUIPOS!H10","v":"JOSÉ ANDRADE"},{"$f":"+EQUIPOS!I10","v":"SOFÍA RIVADENEIRA"},{"$f":"+EQUIPOS!J10","v":"ARTURO RIBADENEIRA "}]
[]
["CATEGORÍA ELITE ABIERTA        "]
[null,null,"JINETE","PUNTAJE"]
{"$rows_left_out":114}
{"sheet":"CAMPEONES 2016","index":1,"n_rows":51,"n_cols":5,"rows_kept":51,"cut":false,"hidden":false,"merged":[[1,1,1,4],[3,1,3,4],[40,1,40,4],[46,1,46,4],[10,1,10,4],[16,1,16,4],[22,1,22,4],[28,1,28,4],[34,1,34,4]]}
[]
[null,"CAMPEONATO ECUATORIANO DE ENDURANCE"]
[]
[null,"CATEGORÍA ELITE ABIERTA  CHASQUI 3"]
[null,null,null,"JINETE","CABALLO"]
[null,1,"CAMPEÓN NACIONAL","ALLAICO EMILIO","ASRAEL"]
[null,2,"VICECAMPEÓN NACIONAL","ALMEIDA HECTOR","AVENTURERO"]
[null,3,null,"DAVIS JAQUELINE","BONBON"]
[null,4,null,"MORABOWEN CESAR","SERENATA CMB"]
[]
{"$rows_left_out":42}
{"sheet":"SUPER CHASQUI","index":2,"n_rows":115,"n_cols":5,"rows_kept":115,"cut":false,"hidden":false,"merged":[[1,2,1,4],[43,1,43,3],[49,1,49,3],[72,1,72,4],[100,1,100,4],[3,1,3,3],[9,1,9,3],[15,1,15,3],[21,1,21,3],[37,1,37,4]]}
[]
[null,null,"PREMIO SUPER CHASQUI DE ENDURANCE"]
[]
[null,"SUPER CHASQUI 3 JINETES"]
[null,null,"JINETE"]
[null,1,"ALMEIDA AYALA HECTOR",3117]
[null,2]
[null,3]
[]
[null,"SUPER CHASQUI 3 CABALLOS"]
{"$rows_left_out":106}
{"sheet":"EQUIPOS","index":3,"n_rows":23,"n_cols":41,"rows_kept":23,"cut":false,"hidden":false,"merged":[[1,1,1,20],[6,4,6,9],[4,1,4,9],[4,10,4,20],[5,10,5,20],[2,1,2,20]]}
[]
[null,"                                                      PUNTAJE  ACUMULADO"]
[null,"                                                                   EQUIPOS"]
[]
[null,"EQUIPOS",null,null,null,null,null,null,null,null,"PUNTAJES"]
[null,null,null,null,null,null,null,null,null,null,2016]
[null,null,"EQUIPO","CAPITAN","               JINETES",null,null,null,null,null,"I CHONE","II CHONE","III CHONE","IV CHONE","V CHONE","VI CHONE","VII CHONE","VIII CHONE","IX CHONE","X CHONE","ACUMULADO"]
[null,1,"ENDURANCE AZUAY","MARIA CONSUELO VELEZ ","PABLO VINTIMILLA","BERNARDA GONZALEZ","CLAUDIA LOYOLA","HECTOR ALMEIDA","JAIME BURBANO","MARIA CONSUELO VELEZ ",398.86,436.79999999999995,null,285.60000000000002,null,418,null,620.39,null,633.9,{"$f":"SUM(K8:T8)","v":2793.55}]
[null,3,"HACIENDA HATO VERDE","CESAR MORABOWEN AGUIRRE ","CESAR MORABOWEN MOSQUERA","JUAN ANTONIO LEON","JORGE DAVALOS","FABRICIO RAMIREZ","CESAR MORABOWEN AGUIRRE ","MAHNKE LIESEL",264.72000000000003,317.60000000000002,null,null,257.60000000000002,null,null,472.18,421.20000000000005,513.5,2246.8000000000002]
[null,2,"CACHAFAZ-SAN ALFONZO","ARTURO RIBADENEIRA ","JOAQUINA DAVALOS","FRANCISCO FALCONÍ","FELIPE PORTILLA","JOSÉ ANDRADE","SOFÍA RIVADENEIRA","ARTURO RIBADENEIRA ",387.28000000000003,436.79999999999995,null,null,null,null,null,null,null,null,824.07999999999993,null,null,null,null,null,null,null,null,null,null,null,null,null,null,null,null,null,null,{"$f":"+$U$8-U9","v":546.75},{"$f":"VLOOKUP(B10,#REF!,3,FALSE)","v":{"$error":"#REF!"}}]
{"$rows_left_out":14}
{"sheet":"ELITE ABIERTA","index":4,"n_rows":51,"n_cols":15,"rows_kept":51,"cut":false,"hidden":false,"merged":[[5,4,5,14],[4,1,4,3],[4,4,4,14],[1,1,1,14],[2,1,2,14]]}
[]
[null,"PUNTAJE  ACUMULADO"]
[null,"CATEGORÍA ABIERTA ELITE"]
[]
[null,"ELITE ABIERTA",null,null,"PUNTAJES"]
[null,null,null,null,2016]
[null,null,"CODIGO","JINETE","I CHONE","II CHONE","III CHONE","IV CHONE","V CHONE","VI CHONE","VII CHONE","VIII CHONE","IX CHONE","X CHONE","ACUMULADO"]
[null,1,"A035","ALMEIDA AYALA HECTOR",130.24,null,null,null,null,160,null,240.2,null,229.9,{"$f":"SUM(E8:N8)","v":760.34}]
[null,2,"A045","MORABOWEN CESAR",null,122,null,null,null,null,null,216.18,129.6,205.7,673.48]
[null,3,"A171","WEEMAELS NATHALIE",162.80000000000001,null,null,null,320,null,null,null,null,162,644.79999999999995]
{"$rows_left_out":42}
{"sheet":"ELITE JUVENIL","index":5,"n_rows":39,"n_cols":15,"rows_kept":39,"cut":false,"hidden":false,"merged":[[5,4,5,14],[4,1,4,3],[4,4,4,14],[1,1,1,14],[2,1,2,14]]}
[]
[null,"PUNTAJE  ACUMULADO"]
[null,"CATEGORÍA JUVENIL ELITE"]
[]
[null,"ELITE JUVENIL",null,null,"PUNTAJES"]
[null,null,null,null,2016]
[null,null,"CODIGO","JINETE","I CHONE","II CHONE","III CHONE","IV CHONE","V CHONE","VI CHONE","VII CHONE","VIII CHONE","IX CHONE","X CHONE","ACUMULADO"]
[null,1,"J063","GONZALEZ BERNARDA",null,134.4,null,134.4,152.38,76,null,152,162,242,{"$f":"SUM(E8:N8)","v":1053.18}]
[null,2,"J034","ANDRADE JOSE DANIEL",null,134.4,null,168,320,64,null,null,null,null,686.4]
[null,3,"J055","LOYOLA CLAUDIA MARIA",null,168,null,84,160.4,80,null,null,null,162,654.4]
{"$rows_left_out":30}
{"sheet":"ELITE MENORES","index":6,"n_rows":39,"n_cols":15,"rows_kept":39,"cut":false,"hidden":false,"merged":[[1,1,1,14],[2,1,2,14],[4,1,4,3],[4,4,4,14],[5,4,5,14]]}
[]
[null,"PUNTAJE  ACUMULADO"]
[null,"CATEGORÍA MENORES ELITE"]
[]
[null,"ELITE MENORES",null,null,"PUNTAJES"]
[null,null,null,null,2016]
[null,null,"CODIGO","JINETE","I CHONE","II CHONE","III CHONE","IV CHONE","V CHONE","VI CHONE","VII CHONE","VIII CHONE","IX CHONE","X CHONE","ACUMULADO"]
[null,1,"M022","MORABOWEN MOSQUERA CESAR",126.80000000000001,122,null,null,128.32000000000002,null,null,128,162,162,{"$f":"SUM(E8:N8)","v":829.12}]
[null,2,null,null,null,null,null,null,null,null,null,null,null,null,0]
[null,3,null,null,null,null,null,null,null,null,null,null,null,null,0]
{"$rows_left_out":30}
{"sheet":"ELITE CABALLOS","index":7,"n_rows":80,"n_cols":16,"rows_kept":80,"cut":false,"hidden":false,"merged":[[5,5,5,15],[4,5,4,15],[1,1,1,15],[2,1,2,15],[4,1,4,4]]}
[]
[null,"PUNTAJE  ACUMULADO"]
[null,"CATEGORÍA CABALLOS ELITE"]
[]
[null,"ELITE CABALLOS",null,null,null,"PUNTAJES"]
[null,null,null,null,null,2016]
[null,null,"CODIGO","CABALLO","DUEÑO/JINETE","I CHONE","II CHONE","III CHONE","IV CHONE","V CHONE","VI CHONE","VII CHONE","VIII CHONE","IX CHONE","X CHONE","ACUMULADO"]
[null,1,"C115","AVENTURERO","HECTOR ALMEIDA AYALA",null,null,null,null,null,null,null,240.2,null,229.9,{"$f":"SUM(F8:O8)","v":470.1}]
[null,2,"C445","ANGOSTURA FRODO","ARTURO RIBADENEIRA",68.960000000000008,134.4,null,null,320,null,null,null,null,null,{"$f":"SUM(F9:O9)-F9","v":454.4}]
[null,3,"C238","CALEÑA CMB","MORABOWEN CESAR",null,122,null,126.80000000000001,128.32000000000002,null,null,128,162,162,{"$f":"SUM(F10:O10)-G10-I10-M10","v":452.31999999999994}]
{"$rows_left_out":71}
{"sheet":"AMATEUR ABIERTA","index":8,"n_rows":94,"n_cols":15,"rows_kept":94,"cut":false,"hidden":false,"merged":[[5,4,5,14],[4,1,4,3],[4,4,4,14],[1,1,1,14],[2,1,2,14]]}
[]
[null,"PUNTAJE  ACUMULADO"]
[null,"CATEGORÍA ABIERTA NOVICIOS"]
[]
[null,"NOVICIOS ABIERTA",null,null,"PUNTAJES"]
[null,null,null,null,2016]
[null,null,"CODIGO","JINETE","I CHONE","II CHONE","III CHONE","IV CHONE","V CHONE","VI CHONE","VII CHONE","VIII CHONE","IX CHONE","X CHONE","ACUMULADO"]
[null,1,"A212","CANGAS GUILLERMO",68.960000000000008,null,null,null,64.64,null,null,128,129.6,null,{"$f":"SUM(E8:N8)","v":391.20000000000005}]
[null,2,"A125","FALCONI FRANCISCO",130.24,null,null,null,128.32000000000002,null,null,null,68.8,null,327.36000000000007]
[null,3,"A179","MANCHENO PAMELA",68.960000000000008,null,null,null,64.64,null,null,null,129.6,null,263.20000000000005]
{"$rows_left_out":85}
{"sheet":"AMATEUR JUVENIL","index":9,"n_rows":83,"n_cols":15,"rows_kept":83,"cut":false,"hidden":false,"merged":[[5,4,5,14],[4,1,4,3],[4,4,4,14],[1,1,1,14],[2,1,2,14]]}
[]
[null,"PUNTAJE  ACUMULADO"]
[null,"CATEGORÍA JUVENIL NOVICIOS"]
[]
[null,"NOVICIOS JUVENIL",null,null,"PUNTAJES"]
[null,null,null,null,2016]
[null,null,"CODIGO","JINETE","I CHONE","II CHONE","III CHONE","IV CHONE","V CHONE","VI CHONE","VII CHONE","VIII CHONE","IX CHONE","X CHONE","ACUMULADO"]
[null,1,"J200","MAZAPANTA LUIS",68.960000000000008,null,null,null,null,null,null,null,null,129.6,{"$f":"SUM(E8:N8)","v":198.56}]
[null,2,"J109","DARQUEA ANA MARIA",130.24,null,null,null,null,64,null,null,null,null,194.24]
[null,3,"J079","JARAMILLO MANUELA",130.24,null,null,null,null,null,null,null,null,null,130.24]
{"$rows_left_out":74}
{"sheet":"AMATEUR MENORES","index":10,"n_rows":50,"n_cols":15,"rows_kept":50,"cut":false,"hidden":false,"merged":[[5,4,5,14],[4,1,4,3],[4,4,4,14],[1,1,1,14],[2,1,2,14]]}
[]
[null,"PUNTAJE  ACUMULADO"]
[null,"CATEGORÍA MENORES NOVICIOS"]
[]
[null,"INFANTIL",null,null,"PUNTAJES"]
[null,null,null,null,2016]
[null,null,"CODIGO","JINETE","I CHONE","II CHONE","III CHONE","IV CHONE","V CHONE","VI CHONE","VII CHONE","VIII CHONE","IX CHONE","X CHONE","ACUMULADO"]
[null,1,"M031","DAVALOS JORGE",68.960000000000008,73.600000000000009,null,null,64.64,null,null,64,null,126,{"$f":"SUM(E8:N8)","v":397.2}]
[null,2,null,null,null,null,null,null,null,null,null,null,null,null,0]
[null,3,null,null,null,null,null,null,null,null,null,null,null,null,0]
{"$rows_left_out":41}
{"sheet":"CABALLOS NOVICIOS","index":11,"n_rows":117,"n_cols":16,"rows_kept":117,"cut":false,"hidden":false,"merged":[[5,5,5,15],[4,1,4,4],[4,5,4,15],[1,1,1,15],[2,1,2,15]]}
[]
[null,"PUNTAJE  ACUMULADO"]
[null,"CATEGORÍA CABALLOS NOVICIOS"]
[]
[null,"CABALLOS  NOVICIOS",null,null,null,"PUNTAJES"]
[null,null,null,null,null,2016]
[null,null,"CODIGO","CABALLO","DUEÑO/JINETE","I CHONE","II CHONE","III CHONE","IV CHONE","V CHONE","VI CHONE","VII CHONE","VIII CHONE","IX CHONE","X CHONE","ACUMULADO"]
[null,1,"C101","CARAMELO CMB","DAVALOS JORGE EDUARDO",68.960000000000008,73.600000000000009,null,null,64.64,null,null,64,null,126,{"$f":"SUM(F8:O8)-M8","v":333.2}]
[null,2,"C441","SANTOO","MARIA CONSUELO VELEZ MENA",null,73.600000000000009,null,67.2,null,128,null,64,null,null,{"$f":"SUM(F9:O9)","v":332.8}]
[null,3,"C417","MANDI CMB","CESAR MORABOWEN",68.960000000000008,null,null,null,64.64,64,null,64,129.6,null,{"$f":"SUM(F10:O10)-K10","v":327.20000000000005}]
{"$rows_left_out":108}
{"sheet":"BINOMIOS ABIERTA","index":12,"n_rows":165,"n_cols":17,"rows_kept":165,"cut":false,"hidden":false,"merged":[[1,1,1,16],[2,1,2,16],[4,1,4,3],[4,6,4,16],[5,6,5,16]]}
[]
[null,"PUNTAJE  ACUMULADO"]
[null,"CATEGORÍA BINOMIOS ABIERTA"]
[]
[null,"BINOMIOS ABIERTA",null,null,null,null,"PUNTAJES"]
[null,null,null,null,null,null,2016]
[null,null,"CODIGO","JINETE","CODIGO","CABALLO","I CHONE","II CHONE","III CHONE","IV CHONE","V CHONE","VI CHONE","VII CHONE","VIII CHONE","IX CHONE","X CHONE","ACUMULADO"]
[null,1,"A059","ALMEIDA AYALA HECTOR","C115","AVENTURERO",null,null,null,null,null,null,null,240.2,null,229.9,{"$f":"SUM(G8:P8)","v":470.1}]
[null,2,"A092","VINTIMILLA PABLO ","C252","BIANCA",138.38,null,null,null,null,76,null,228.18999999999997,null,null,442.56999999999994]
[null,3,"A045","MORABOWEN CESAR","C329","SERENATA CMB",null,null,null,null,null,null,null,216.18,null,205.7,421.88]
{"$rows_left_out":156}
{"sheet":"BINOMIOS LIVIANOS","index":13,"n_rows":165,"n_cols":17,"rows_kept":165,"cut":false,"hidden":false,"merged":[[1,1,1,16],[2,1,2,16],[4,1,4,3],[4,6,4,16],[5,6,5,16]]}
[]
[null,"PUNTAJE  ACUMULADO"]
[null,"CATEGORÍA BINOMIOS LIVIANOS"]
[]
[null,"BINOMIOS LIVIANOS",null,null,null,null,"PUNTAJES"]
[null,null,null,null,null,null,2016]
[null,null,"CODIGO","JINETE","CODIGO","CABALLO","I CHONE","II CHONE","III CHONE","IV CHONE","V CHONE","VI CHONE","VII CHONE","VIII CHONE","IX CHONE","X CHONE","ACUMULADO"]
[null,1,"M047","MORABOWEN MOSQUERA CESAR","C238","CALEÑA CMB",122,126.80000000000001,null,null,128.32000000000002,null,null,128,162,162,{"$f":"SUM(G8:P8)-G8-H8","v":580.31999999999994}]
[null,2,"J063","GONZALEZ BERNARDA","C333","KADIN",null,null,null,null,null,76,null,null,162,242,{"$f":"SUM(G9:P9)","v":480}]
[null,3,"J063","GONZALEZ BERNARDA","C394","POLACO",134.4,null,null,134.4,null,null,null,152,null,null,420.8]
{"$rows_left_out":156}
{"sheet":"PR MASTER","index":14,"n_rows":55,"n_cols":15,"rows_kept":55,"cut":false,"hidden":false,"merged":[[1,1,1,14],[2,1,2,14],[4,1,4,3],[4,4,4,14],[5,4,5,14]]}
[]
[null,"PUNTAJE  ACUMULADO"]
[null,"CATEGORÍA PROMOCIONAL ABIERTA"]
[]
[null,"PROMOCIONAL MASTER",null,null,"PUNTAJES"]
[null,null,null,null,2016]
[null,null,"CODIGO","JINETE","I CHONE","II CHONE","III CHONE","IV CHONE","V CHONE","VI CHONE","VII CHONE","VIII CHONE","IX CHONE","X CHONE","ACUMULADO"]
[null,1,"A024","RECALDE GALO",null,null,null,null,64.64,null,null,null,null,null,{"$f":"SUM(E8:N8)","v":64.64}]
[null,2,null,null,null,null,null,null,null,null,null,null,null,null,0]
[null,3,null,null,null,null,null,null,null,null,null,null,null,null,0]
{"$rows_left_out":46}
{"sheet":"PR ABIERTA","index":15,"n_rows":55,"n_cols":15,"rows_kept":55,"cut":false,"hidden":false,"merged":[[1,1,1,14],[2,1,2,14],[4,1,4,3],[4,4,4,14],[5,4,5,14]]}
[]
[null,"PUNTAJE  ACUMULADO"]
[null,"CATEGORÍA PROMOCIONAL ABIERTA"]
[]
[null,"PROMOCIONAL ABIERTA",null,null,"PUNTAJES"]
[null,null,null,null,2016]
[null,null,"CODIGO","JINETE","I CHONE","II CHONE","III CHONE","IV CHONE","V CHONE","VI CHONE","VII CHONE","VIII CHONE","IX CHONE","X CHONE","ACUMULADO"]
[null,1,"A247","ESTRADA CARLOS",null,null,null,null,32.32,null,null,null,68.8,68.8,{"$f":"SUM(E8:N8)","v":169.92000000000002}]
[null,2,"A196","MONCAYO FERNANDO",null,null,null,null,58.176000000000002,null,null,null,65.36,null,123.536]
[null,3,"A089","ORTIZ FERNANDO",68.960000000000008,null,null,null,null,null,null,null,null,null,68.960000000000008]
{"$rows_left_out":46}
{"sheet":"PR JUVENIL","index":16,"n_rows":50,"n_cols":15,"rows_kept":50,"cut":false,"hidden":false,"merged":[[1,1,1,14],[2,1,2,14],[4,1,4,3],[4,4,4,14],[5,4,5,14]]}
[]
[null,"PUNTAJE  ACUMULADO"]
[null,"CATEGORÍA PROMOCIONAL JUVENIL"]
[]
[null,"PROMOCIONAL JUVENIL",null,null,"PUNTAJES"]
[null,null,null,null,2016]
[null,null,"CODIGO","JINETE","I CHONE","II CHONE","III CHONE","IV CHONE","V CHONE","VI CHONE","VII CHONE","VIII CHONE","IX CHONE","X CHONE","ACUMULADO"]
[null,1,"J105","NOROÑA JORDAN",null,null,null,null,null,null,null,null,68.8,null,{"$f":"SUM(E8:N8)","v":68.8}]
[null,2,"J040","GABRIEL DARQUEA",null,null,null,null,null,null,null,null,null,68.8,68.8]
[null,3,"J116","BARBARA ESPINOZA",null,null,null,null,null,null,null,null,null,65.36,65.36]
{"$rows_left_out":41}
{"sheet":"PR MENORES","index":17,"n_rows":50,"n_cols":15,"rows_kept":50,"cut":false,"hidden":false,"merged":[[1,1,1,14],[2,1,2,14],[4,1,4,3],[4,4,4,14],[5,4,5,14]]}
[]
[null,"PUNTAJE  ACUMULADO"]
[null,"CATEGORÍA PROMOCIONAL MENORES"]
[]
[null,"PROMOCIONAL MENORES",null,null,"PUNTAJES"]
[null,null,null,null,2016]
[null,null,"CODIGO","JINETE","I CHONE","II CHONE","III CHONE","IV CHONE","V CHONE","VI CHONE","VII CHONE","VIII CHONE","IX CHONE","X CHONE","ACUMULADO"]
[null,1,"M028","CORREA JUAN MARTIN",null,null,null,null,null,null,null,null,28.8,32,{"$f":"SUM(E8:N8)","v":60.8}]
[null,2,"M031","ESPINOZA NATALIA",null,null,null,null,58.176000000000002,null,null,null,null,null,{"$f":"SUM(E9:N9)","v":58.176000000000002}]
[null,3,"I019","CASTILLO DAFNE",null,null,null,null,null,null,null,null,32,null,{"$f":"SUM(E10:N10)","v":32}]
{"$rows_left_out":41}
{"sheet":"PR INFANTIL","index":18,"n_rows":50,"n_cols":15,"rows_kept":50,"cut":false,"hidden":false,"merged":[[1,1,1,14],[2,1,2,14],[4,1,4,3],[4,4,4,14],[5,4,5,14]]}
[]
[null,"PUNTAJE  ACUMULADO"]
[null,"CATEGORÍA PROMOCIONAL INFANTIL"]
[]
[null,"PROMOCIONAL INFANTIL",null,null,"PUNTAJES"]
[null,null,null,null,2016]
[null,null,"CODIGO","JINETE","I CHONE","II CHONE","III CHONE","IV CHONE","V CHONE","VI CHONE","VII CHONE","VIII CHONE","IX CHONE","X CHONE","ACUMULADO"]
[null,1,null,null,null,null,null,null,null,null,null,null,null,null,{"$f":"SUM(E8:N8)","v":0}]
[null,2,null,null,null,null,null,null,null,null,null,null,null,null,0]
[null,3,null,null,null,null,null,null,null,null,null,null,null,null,0]
{"$rows_left_out":41}
{"sheet":"PR ADULTO-MENOR","index":19,"n_rows":165,"n_cols":15,"rows_kept":165,"cut":false,"hidden":false,"merged":[[1,1,1,14],[2,1,2,14],[4,1,4,2],[4,4,4,14],[5,4,5,14]]}
[]
[null,"PUNTAJE  ACUMULADO"]
[null,"CATEGORÍA PROMOCIONAL ADULTO/MENOR"]
[]
[null,"BINOMIOS ABIERTA",null,null,"PUNTAJES"]
[null,null,null,null,2016]
[null,null,"MENOR","ADULTOS","I CHONE","II CHONE","III CHONE","IV CHONE","V CHONE","VI CHONE","VII CHONE","VIII CHONE","IX CHONE","X CHONE","ACUMULADO"]
[null,1,"CASTILLO DAFNE",null,null,null,null,null,null,null,null,null,null,null,64.64]
[null,2,"SERRANO OLIVIA",null,32.480000000000004,null,null,null,30.703999999999997,null,null,null,null,null,{"$f":"SUM(E9:N9)","v":63.183999999999997}]
[null,3,"JARA RAFAELA",null,null,null,null,null,32.32,null,null,null,null,null,32.32]
{"$rows_left_out":155}