{"text_format":"1","workbook":"xlsx","n_sheets":20,"sheets":["RANKING 2017","CAMPEONES 2017","SUPER CHASQUI","EQUIPOS","ELITE ABIERTA","ELITE JUVENIL","ELITE MENORES","ELITE CABALLOS","AMATEUR ABIERTA","AMATEUR JUVENIL","AMATEUR MENORES","CABALLOS NOVICIOS","BINOMIOS ABIERTA","BINOMIOS LIVIANOS","PR MASTER","PR ABIERTA","PR JUVENIL","PR MENORES","PR INFANTIL","PR ADULTO-MENOR"],"not_rendered":{"charts":0,"images":0,"macros":1,"external_links":0,"defined_names":137,"comments":0,"pivot_tables":0},"unopened":[],"bounds":{"document_bytes":16777216,"sheet_cells":100000,"rows_first":2000,"rows_last":500,"rows_between":2000,"halvings":0,"cell_chars":16384,"cell_head_chars":4096},"cells_cut":0,"cells_raw":0,"read":"whole","date_system":"1900"}

{"sheet":"RANKING 2017","index":0,"n_rows":120,"n_cols":11,"rows_kept":120,"cut":false,"hidden":false,"merged":[[97,0,97,3],[113,0,113,3],[3,5,3,10],[2,0,2,10],[0,0,0,10],[105,0,105,3],[33,0,33,4],[8,0,8,3],[16,0,16,3],[25,0,25,4],[65,0,65,3],[73,0,73,4],[49,0,49,3],[57,0,57,3],[41,0,41,4],[81,0,81,3],[89,0,89,3]]}
["                                                  RANKING NACIONAL DE ENDURANCE ECUADOR 2015"]
[]
["CAMPEONATO DE EQUIPOS                                        "]
[null,null,"EQUIPO","CAPITAN","PUNTAJE","               JINETES"]
[1,"CAMPEÓN NACIONAL",{"$f":"+EQUIPOS!C8","v":"ENDURANCE AZUAY"},{"$f":"+EQUIPOS!D8","v":"MARIA CONSUELO VELEZ "},{"$f":"+EQUIPOS!U8","v":2922.57},{"$f":"+EQUIPOS!E8","v":"PABLO VINTIMILLA"},{"$f":"+EQUIPOS!F8","v":"BERNARDA GONZALEZ"},{"$f":"+EQUIPOS!G8","v":"CLAUDIA LOYOLA"},{"$f":"+EQUIPOS!H8","v":"HECTOR ALMEIDA"},{"$f":"+EQUIPOS!I8","v":"JOSE ANDRADE"},{"$f":"+EQUIPOS!J8","v":"MARIA CONSUELO VELEZ "}]
[2,"VICECAMPEÓN NACIONAL",{"$f":"+EQUIPOS!C9","v":"SELECT"},{"$f":"+EQUIPOS!D9","v":"ARMANDO SERRANO"},{"$f":"+EQUIPOS!U9","v":1117.08},{"$f":"+EQUIPOS!E9","v":"MANUELA JARAMILLO"},{"$f":"+EQUIPOS!F9","v":"BERNARDA LETORT"},{"$f":"+EQUIPOS!G9","v":"JOSE LETORT MENA"},{"$f":"+EQUIPOS!H9","v":"ARMANDO SERRANO"},{"$f":"+EQUIPOS!I9","v":"LUIS MASAPANTA"},{"$f":"+EQUIPOS!J9","v":"MARIO CANDO"}]
[3,null,{"$f":"+EQUIPOS!C10","v":"EQUINOCCIAL"},{"$f":"+EQUIPOS!D10","v":"BERNARDO DARQUEA"},{"$f":"+EQUIPOS!U10","v":861.08400000000006},{"$f":"+EQUIPOS!E10","v":0},{"$f":"+EQUIPOS!F10","v":0},{"$f":"+EQUIPOS!G10","v":"RECALDE JUAN JOSE"},{"$f":"+EQUIPOS!H10","v":"DARQUEA RICARDO"},{"$f":"+EQUIPOS!I10","v":"DARQUEA GABRIEL"},{"$f":"+EQUIPOS!J10","v":"DARQUEA ANDRES"}]
[]
["CATEGORÍA ELITE ABIERTA        "]
[null,null,"JINETE","PUNTAJE"]
{"$rows_left_out":111}
{"sheet":"CAMPEONES 2017","index":1,"n_rows":52,"n_cols":5,"rows_kept":52,"cut":false,"hidden":false,"merged":[[1,1,1,4],[3,1,3,4],[41,1,41,4],[47,1,47,4],[10,1,10,4],[16,1,16,4],[22,1,22,4],[29,1,29,4],[35,1,35,4]]}
[]
[null,"CAMPEONATO ECUATORIANO DE ENDURANCE"]
[]
[null,"CATEGORÍA ELITE ABIERTA  CHASQUI 3"]
[null,null,null,"JINETE","CABALLO"]
[null,1,"CAMPEÓN NACIONAL","ALMEIDA HECTOR","AVENTURERO"]
[null,2,"VICECAMPEÓN NACIONAL"]
[null,3]
[null,4]
[]
{"$rows_left_out":43}
{"sheet":"SUPER CHASQUI","index":2,"n_rows":115,"n_cols":5,"rows_kept":115,"cut":false,"hidden":false,"merged":[[1,2,1,4],[43,1,43,3],[49,1,49,3],[72,1,72,4],[100,1,100,4],[3,1,3,3],[9,1,9,3],[15,1,15,3],[21,1,21,3],[37,1,37,4]]}
[]
[null,null,"PREMIO SUPER CHASQUI DE ENDURANCE"]
[]
[null,"SUPER CHASQUI 3 JINETES (3000 Km)"]
[null,null,"JINETE"]
[null,1,"ALMEIDA AYALA HECTOR",3732]
[null,2,"ANDRADE JOSE DANIEL",3055]
[null,3]
[]
[null,"SUPER CHASQUI 3 CABALLOS"]
{"$rows_left_out":106}
{"sheet":"EQUIPOS","index":3,"n_rows":23,"n_cols":41,"rows_kept":23,"cut":false,"hidden":false,"merged":[[1,1,1,20],[6,4,6,9],[4,1,4,9],[4,10,4,20],[5,10,5,20],[2,1,2,20]]}
[]
[null,"                                                      PUNTAJE  ACUMULADO"]
[null,"                                                                   EQUIPOS"]
[]
[null,"EQUIPOS",null,null,null,null,null,null,null,null,"PUNTAJES"]
[null,null,null,null,null,null,null,null,null,null,2017]
[null,null,"EQUIPO","CAPITAN","               JINETES",null,null,null,null,null,"I CHONE","II CHONE","III CHONE","IV CHONE","V CHONE","VI CHONE","VII CHONE","VIII CHONE","IX CHONE","X CHONE","ACUMULADO"]
[null,1,"ENDURANCE AZUAY","MARIA CONSUELO VELEZ ","PABLO VINTIMILLA","BERNARDA GONZALEZ","CLAUDIA LOYOLA","HECTOR ALMEIDA","JOSE ANDRADE","MARIA CONSUELO VELEZ ",416,null,585.08000000000004,440.1,null,448.4,null,472.59,null,{"$f":"240.2+240.2+80","v":560.4},{"$f":"SUM(K8:T8)","v":2922.57}]
[null,2,"SELECT","ARMANDO SERRANO","MANUELA JARAMILLO","BERNARDA LETORT","JOSE LETORT MENA","ARMANDO SERRANO","LUIS MASAPANTA","MARIO CANDO",null,362.88,null,null,null,null,490.2,264,null,null,{"$f":"SUM(K9:T9)","v":1117.08}]
[null,3,"EQUINOCCIAL","BERNARDO DARQUEA",null,null,"RECALDE JUAN JOSE","DARQUEA RICARDO","DARQUEA GABRIEL","DARQUEA ANDRES",null,null,352.22,null,215.82400000000001,null,null,293.04000000000002,null,null,{"$f":"SUM(K10:T10)","v":861.08400000000006},null,null,null,null,null,null,null,null,null,null,null,null,null,null,null,null,null,null,{"$f":"+$U$8-U9","v":1805.4900000000002},{"$f":"VLOOKUP(B10,#REF!,3,FALSE)","v":{"$error":"#REF!"}}]
{"$rows_left_out":14}
{"sheet":"ELITE ABIERTA","index":4,"n_rows":55,"n_cols":15,"rows_kept":55,"cut":false,"hidden":false,"merged":[[5,4,5,14],[4,1,4,3],[4,4,4,14],[1,1,1,14],[2,1,2,14]]}
[]
[null,"PUNTAJE  ACUMULADO"]
[null,"CATEGORÍA ABIERTA ELITE"]
[]
[null,"ELITE ABIERTA",null,null,"PUNTAJES"]
[null,null,null,null,2017]
[null,null,"CODIGO","JINETE","I CHONE","II CHONE","III CHONE","IV CHONE","V CHONE","VI CHONE","VII CHONE","VIII CHONE","IX CHONE","X CHONE","ACUMULADO"]
[null,1,"A035","ALMEIDA AYALA HECTOR",144,159.6,216.36,83.41,null,null,163.4,null,145.80000000000001,240.2,{"$f":"SUM(E8:N8)","v":1152.77}]
[null,2,"A248","LOYOLA MARIA CLAUDIA",80,null,128.32000000000002,130.4,121.904,160.19999999999999,null,128,null,80,{"$f":"SUM(E9:N9)","v":828.82400000000007}]
[null,3,"A045","MORABOWEN CESAR",160,134.4,240.4,null,null,null,154.80000000000001,null,null,null,689.59999999999991]
{"$rows_left_out":46}
{"sheet":"ELITE JUVENIL","index":5,"n_rows":39,"n_cols":15,"rows_kept":39,"cut":false,"hidden":false,"merged":[[5,4,5,14],[4,1,4,3],[4,4,4,14],[1,1,1,14],[2,1,2,14]]}
[]
[null,"PUNTAJE  ACUMULADO"]
[null,"CATEGORÍA JUVENIL ELITE"]
[]
[null,"ELITE JUVENIL",null,null,"PUNTAJES"]
[null,null,null,null,2017]
[null,null,"CODIGO","JINETE","I CHONE","II CHONE","III CHONE","IV CHONE","V CHONE","VI CHONE","VII CHONE","VIII CHONE","IX CHONE","X CHONE","ACUMULADO"]
[null,1,"J063","GONZALEZ BERNARDA",null,null,240.4,163,null,160.19999999999999,null,160.19999999999999,null,240.2,{"$f":"SUM(E8:N8)","v":964}]
[null,2,"J079","JARAMILLO MANUELA",null,67.2,228.38,null,null,null,172,null,129.6,null,597.17999999999995]
[null,3,"M022","MORABOWEN MOSQUERA CESAR",null,168,160.4,null,null,null,null,null,53.760000000000005,160,542.16]
{"$rows_left_out":30}
{"sheet":"ELITE MENORES","index":6,"n_rows":39,"n_cols":15,"rows_kept":39,"cut":false,"hidden":true,"merged":[[1,1,1,14],[2,1,2,14],[4,1,4,3],[4,4,4,14],[5,4,5,14]]}
[]
[null,"PUNTAJE  ACUMULADO"]
[null,"CATEGORÍA MENORES ELITE"]
[]
[null,"ELITE MENORES",null,null,"PUNTAJES"]
[null,null,null,null,2017]
[null,null,"CODIGO","JINETE","I CHONE","II CHONE","III CHONE","IV CHONE","V CHONE","VI CHONE","VII CHONE","VIII CHONE","IX CHONE","X CHONE","ACUMULADO"]
[null,1,null,null,null,null,null,null,null,null,null,null,null,null,{"$f":"SUM(E8:N8)","v":0}]
[null,2,null,null,null,null,null,null,null,null,null,null,null,null,0]
[null,3,null,null,null,null,null,null,null,null,null,null,null,null,0]
{"$rows_left_out":30}
{"sheet":"ELITE CABALLOS","index":7,"n_rows":83,"n_cols":16,"rows_kept":83,"cut":false,"hidden":false,"merged":[[5,5,5,15],[4,5,4,15],[1,1,1,15],[2,1,2,15],[4,1,4,4]]}
[]
[null,"PUNTAJE  ACUMULADO"]
[null,"CATEGORÍA CABALLOS ELITE"]
[]
[null,"ELITE CABALLOS",null,null,null,"PUNTAJES"]
[null,null,null,null,null,2017]
[null,null,"CODIGO","CABALLO","DUEÑO/JINETE","I CHONE","II CHONE","III CHONE","IV CHONE","V CHONE","VI CHONE","VII CHONE","VIII CHONE","IX CHONE","X CHONE","ACUMULADO"]
[null,1,"C232","ASRAEL","BERNARDO GONZALEZ",null,null,null,163,null,null,null,160.19999999999999,null,240.2,{"$f":"SUM(F8:O8)","v":563.4}]
[null,2,"C046","AMARETO","LETORT BERNARDA",null,168,228.38,null,null,null,146.19999999999999,null,null,null,{"$f":"SUM(F9:O9)","v":542.57999999999993}]
[null,3,"C114","KAFIR HA","HECTOR ALMEIDA AYALA",null,159.6,216.36,null,null,null,null,null,null,115.2,{"$f":"SUM(F10:O10)","v":491.16}]
{"$rows_left_out":74}
{"sheet":"AMATEUR ABIERTA","index":8,"n_rows":94,"n_cols":15,"rows_kept":94,"cut":false,"hidden":false,"merged":[[5,4,5,14],[4,1,4,3],[4,4,4,14],[1,1,1,14],[2,1,2,14]]}
[]
[null,"PUNTAJE  ACUMULADO"]
[null,"CATEGORÍA ABIERTA NOVICIOS"]
[]
[null,"NOVICIOS ABIERTA",null,null,"PUNTAJES"]
[null,null,null,null,2017]
[null,null,"CODIGO","JINETE","I CHONE","II CHONE","III CHONE","IV CHONE","V CHONE","VI CHONE","VII CHONE","VIII CHONE","IX CHONE","X CHONE","ACUMULADO"]
[null,1,"A236","JUNE TATE",null,63.84,null,null,null,null,null,57.6,123.12,115.2,{"$f":"SUM(E8:N8)","v":359.76}]
[null,2,"A064","DIEGO CASTILLO",null,null,null,null,65.36,null,137.6,null,129.6,null,332.55999999999995]
[null,3,"A240","GONZALEZ XIMENA ",null,null,null,63.22,68.8,null,null,null,null,128,260.02]
{"$rows_left_out":85}
{"sheet":"AMATEUR JUVENIL","index":9,"n_rows":83,"n_cols":15,"rows_kept":83,"cut":false,"hidden":false,"merged":[[5,4,5,14],[4,1,4,3],[4,4,4,14],[1,1,1,14],[2,1,2,14]]}
[]
[null,"PUNTAJE  ACUMULADO"]
[null,"CATEGORÍA JUVENIL NOVICIOS"]
[]
[null,"NOVICIOS JUVENIL",null,null,"PUNTAJES"]
[null,null,null,null,2017]
[null,null,"CODIGO","JINETE","I CHONE","II CHONE","III CHONE","IV CHONE","V CHONE","VI CHONE","VII CHONE","VIII CHONE","IX CHONE","X CHONE","ACUMULADO"]
[null,1,"J114","MASAPANTA LUIS",null,null,128.32000000000002,null,null,null,null,null,67.2,null,{"$f":"SUM(E8:N8)","v":195.52000000000004}]
[null,2,"J241","PEREZ SANDRO",null,null,68.8,68.8,null,null,null,null,null,null,137.6]
[null,3,"J015","ANDRES DARQUEA",null,null,null,null,null,null,68.8,null,60.480000000000011,null,129.28]
{"$rows_left_out":74}
{"sheet":"AMATEUR MENORES","index":10,"n_rows":50,"n_cols":15,"rows_kept":50,"cut":false,"hidden":false,"merged":[[5,4,5,14],[4,1,4,3],[4,4,4,14],[1,1,1,14],[2,1,2,14]]}
[]
[null,"PUNTAJE  ACUMULADO"]
[null,"CATEGORÍA MENORES NOVICIOS"]
[]
[null,"INFANTIL",null,null,"PUNTAJES"]
[null,null,null,null,2017]
[null,null,"CODIGO","JINETE","I CHONE","II CHONE","III CHONE","IV CHONE","V CHONE","VI CHONE","VII CHONE","VIII CHONE","IX CHONE","X CHONE","ACUMULADO"]
[null,2,null,"ANDRADE FELIPE ANDRES",null,null,87.8,null,null,64,null,null,null,80,{"$f":"SUM(E8:N8)","v":231.8}]
[null,1,null,"LOPEZ JUAN RAFAEL",null,null,130.4,null,null,null,null,null,null,null,{"$f":"SUM(E9:N9)","v":130.4}]
[null,3,null,"DONOSO JULIAN",null,null,83.41,null,null,null,null,null,null,null,{"$f":"SUM(E10:N10)","v":83.41}]
{"$rows_left_out":41}
{"sheet":"CABALLOS NOVICIOS","index":11,"n_rows":120,"n_cols":16,"rows_kept":120,"cut":false,"hidden":false,"merged":[[5,5,5,15],[4,1,4,4],[4,5,4,15],[1,1,1,15],[2,1,2,15]]}
[]
[null,"PUNTAJE  ACUMULADO"]
[null,"CATEGORÍA CABALLOS NOVICIOS"]
[]
[null,"CABALLOS  NOVICIOS",null,null,null,"PUNTAJES"]
[null,null,null,null,null,2017]
[null,null,"CODIGO","CABALLO","DUEÑO/JINETE","I CHONE","II CHONE","III CHONE","IV CHONE","V CHONE","VI CHONE","VII CHONE","VIII CHONE","IX CHONE","X CHONE","ACUMULADO"]
[null,1,"C288","LIA","MAURICIO NOBOA",null,null,126,null,null,null,119.69999999999999,null,117.8,null,{"$f":"SUM(F8:O8)","v":363.5}]
[null,2,"C059","GS RASHID","DIEGO CASTILLO",null,null,null,null,65.36,null,137.6,null,129.6,null,332.55999999999995]
[null,3,"C403","MARAVILLA","HECTOR ALMEIDA AYALA",null,null,68.8,null,68.8,null,null,null,123.12,null,260.72000000000003]
{"$rows_left_out":111}
{"sheet":"BINOMIOS ABIERTA","index":12,"n_rows":165,"n_cols":17,"rows_kept":165,"cut":false,"hidden":false,"merged":[[1,1,1,16],[2,1,2,16],[4,1,4,3],[4,6,4,16],[5,6,5,16]]}
[]
[null,"PUNTAJE  ACUMULADO"]
[null,"CATEGORÍA BINOMIOS ABIERTA"]
[]
[null,"BINOMIOS ABIERTA",null,null,null,null,"PUNTAJES"]
[null,null,null,null,null,null,2017]
[null,null,"CODIGO","JINETE","CODIGO","CABALLO","I CHONE","II CHONE","III CHONE","IV CHONE","V CHONE","VI CHONE","VII CHONE","VIII CHONE","IX CHONE","X CHONE","ACUMULADO"]
[null,1,"A250","ESTRADA CARLOS","C473","SC SHADID",64,67.2,121.904,null,128.32000000000002,null,126,null,162,null,{"$f":"SUM(I8:P8)","v":538.22400000000005}]
[null,2,"J055","LOYOLA CLAUDIA MARIA","C197","PATACON",80,null,null,130.4,null,160.19999999999999,null,128,null,80,{"$f":"SUM(J9:P9)","v":498.6}]
[null,3,"A059","ALMEIDA AYALA HECTOR ","C115","AVENTURERO",null,null,null,null,null,null,163.4,null,null,240.2,{"$f":"SUM(G10:P10)","v":403.6}]
{"$rows_left_out":156}
{"sheet":"BINOMIOS LIVIANOS","index":13,"n_rows":165,"n_cols":17,"rows_kept":165,"cut":false,"hidden":false,"merged":[[1,1,1,16],[2,1,2,16],[4,1,4,3],[4,6,4,16],[5,6,5,16]]}
[]
[null,"PUNTAJE  ACUMULADO"]
[null,"CATEGORÍA BINOMIOS LIVIANOS"]
[]
[null,"BINOMIOS LIVIANOS",null,null,null,null,"PUNTAJES"]
[null,null,null,null,null,null,2017]
[null,null,"CODIGO","JINETE","CODIGO","CABALLO","I CHONE","II CHONE","III CHONE","IV CHONE","V CHONE","VI CHONE","VII CHONE","VIII CHONE","IX CHONE","X CHONE","ACUMULADO"]
[null,1,"J063","GONZALEZ BERNARDA","C232","ASRAEL",null,null,null,163,null,null,null,160.19999999999999,null,240.2,{"$f":"SUM(G8:P8)","v":563.4}]
[null,2,"M047","MORABOWEN MOSQUERA CESAR","C238","CALEÑA CMB",null,168,160.4,null,null,null,null,null,57.12,160,545.52]
[null,3,"J109","RICARDO DARQUEA","C376","NABU",null,null,null,null,121.904,null,null,null,162,null,283.904]
{"$rows_left_out":156}
{"sheet":"PR MASTER","index":14,"n_rows":55,"n_cols":15,"rows_kept":55,"cut":false,"hidden":true,"merged":[[1,1,1,14],[2,1,2,14],[4,1,4,3],[4,4,4,14],[5,4,5,14]]}
[]
[null,"PUNTAJE  ACUMULADO"]
[null,"CATEGORÍA PROMOCIONAL ABIERTA"]
[]
[null,"PROMOCIONAL MASTER",null,null,"PUNTAJES"]
[null,null,null,null,2016]
[null,null,"CODIGO","JINETE","I CHONE","II CHONE","III CHONE","IV CHONE","V CHONE","VI CHONE","VII CHONE","VIII CHONE","IX CHONE","X CHONE","ACUMULADO"]
[null,1,null,null,null,null,null,null,null,null,null,null,null,null,{"$f":"SUM(E8:N8)","v":0}]
[null,2,null,null,null,null,null,null,null,null,null,null,null,null,0]
[null,3,null,null,null,null,null,null,null,null,null,null,null,null,0]
{"$rows_left_out":46}
{"sheet":"PR ABIERTA","index":15,"n_rows":58,"n_cols":15,"rows_kept":58,"cut":false,"hidden":false,"merged":[[1,1,1,14],[2,1,2,14],[4,1,4,3],[4,4,4,14],[5,4,5,14]]}
[]
[null,"PUNTAJE  ACUMULADO"]
[null,"CATEGORÍA PROMOCIONAL ABIERTA"]
[]
[null,"PROMOCIONAL ABIERTA",null,null,"PUNTAJES"]
[null,null,null,null,2017]
[null,null,"CODIGO","JINETE","I CHONE","II CHONE","III CHONE","IV CHONE","V CHONE","VI CHONE","VII CHONE","VIII CHONE","IX CHONE","X CHONE","ACUMULADO"]
[null,1,"A197","CORO RODRIGO",null,null,65.36,null,68.8,null,61.92,null,null,null,{"$f":"SUM(E8:N8)","v":196.07999999999998}]
[null,2,"A313","MONCAYO FERNANDO",null,null,61.92,null,null,null,51.599999999999994,null,null,null,113.52]
[null,3,"A316","CONTRERAS JONATHAN",null,32,null,null,65.36,null,null,null,null,null,97.36]
{"$rows_left_out":49}
{"sheet":"PR JUVENIL","index":16,"n_rows":50,"n_cols":15,"rows_kept":50,"cut":false,"hidden":true,"merged":[[1,1,1,14],[2,1,2,14],[4,1,4,3],[4,4,4,14],[5,4,5,14]]}
[]
[null,"PUNTAJE  ACUMULADO"]
[null,"CATEGORÍA PROMOCIONAL JUVENIL"]
[]
[null,"PROMOCIONAL JUVENIL",null,null,"PUNTAJES"]
[null,null,null,null,2016]
[null,null,"CODIGO","JINETE","I CHONE","II CHONE","III CHONE","IV CHONE","V CHONE","VI CHONE","VII CHONE","VIII CHONE","IX CHONE","X CHONE","ACUMULADO"]
[null,1,"J105","NOROÑA JORDAN",null,null,null,null,null,null,null,null,68.8,null,{"$f":"SUM(E8:N8)","v":68.8}]
[null,2,"J040","GABRIEL DARQUEA",null,null,null,null,null,null,null,null,null,68.8,68.8]
[null,3,"J116","BARBARA ESPINOZA",null,null,null,null,null,null,null,null,null,65.36,65.36]
{"$rows_left_out":41}
{"sheet":"PR MENORES","index":17,"n_rows":50,"n_cols":15,"rows_kept":50,"cut":false,"hidden":true,"merged":[[1,1,1,14],[2,1,2,14],[4,1,4,3],[4,4,4,14],[5,4,5,14]]}
[]
[null,"PUNTAJE  ACUMULADO"]
[null,"CATEGORÍA PROMOCIONAL MENORES"]
[]
[null,"PROMOCIONAL MENORES",null,null,"PUNTAJES"]
[null,null,null,null,2016]
[null,null,"CODIGO","JINETE","I CHONE","II CHONE","III CHONE","IV CHONE","V CHONE","VI CHONE","VII CHONE","VIII CHONE","IX CHONE","X CHONE","ACUMULADO"]
[null,1,"M028","CORREA JUAN MARTIN",null,null,null,null,null,null,null,null,28.8,32,{"$f":"SUM(E8:N8)","v":60.8}]
[null,2,"M031","ESPINOZA NATALIA",null,null,null,null,58.176000000000002,null,null,null,null,null,{"$f":"SUM(E9:N9)","v":58.176000000000002}]
[null,3,"I019","CASTILLO DAFNE",null,null,null,null,null,null,null,null,32,null,{"$f":"SUM(E10:N10)","v":32}]
{"$rows_left_out":41}
{"sheet":"PR INFANTIL","index":18,"n_rows":50,"n_cols":15,"rows_kept":50,"cut":false,"hidden":false,"merged":[[1,1,1,14],[2,1,2,14],[4,1,4,3],[4,4,4,14],[5,4,5,14]]}
[]
[null,"PUNTAJE  ACUMULADO"]
[null,"CATEGORÍA PROMOCIONAL INFANTIL"]
[]
[null,"PROMOCIONAL INFANTIL",null,null,"PUNTAJES"]
[null,null,null,null,2017]
[null,null,"CODIGO","JINETE","I CHONE","II CHONE","III CHONE","IV CHONE","V CHONE","VI CHONE","VII CHONE","VIII CHONE","IX CHONE","X CHONE","ACUMULADO"]
[null,1,"I038","DARQUEA EMILIO",null,32,null,null,32,null,null,null,67.2,null,{"$f":"SUM(E8:N8)","v":131.19999999999999}]
[null,2,"I044","MOYA MARTINA ",null,67.2,null,null,null,null,null,null,null,null,{"$f":"SUM(E9:N9)","v":67.2}]
[null,3,"I050","JULIAN NOBOA",null,null,null,null,null,null,32,null,32,null,{"$f":"SUM(E10:N10)","v":64}]
{"$rows_left_out":41}
{"sheet":"PR ADULTO-MENOR","index":19,"n_rows":165,"n_cols":15,"rows_kept":165,"cut":false,"hidden":true,"merged":[[1,1,1,14],[2,1,2,14],[4,1,4,2],[4,4,4,14],[5,4,5,14]]}
[]
[null,"PUNTAJE  ACUMULADO"]
[null,"CATEGORÍA PROMOCIONAL ADULTO/MENOR"]
[]
[null,"BINOMIOS ABIERTA",null,null,"PUNTAJES"]
[null,null,null,null,2016]
[null,null,"MENOR","ADULTOS","I CHONE","II CHONE","III CHONE","IV CHONE","V CHONE","VI CHONE","VII CHONE","VIII CHONE","IX CHONE","X CHONE","ACUMULADO"]
[null,1,"CASTILLO DAFNE",null,null,null,null,null,null,null,null,null,null,null,64.64]
[null,2,"SERRANO OLIVIA",null,32.480000000000004,null,null,null,30.703999999999997,null,null,null,null,null,{"$f":"SUM(E9:N9)","v":63.183999999999997}]
[null,3,"JARA RAFAELA",null,null,null,null,null,32.32,null,null,null,null,null,32.32]
{"$rows_left_out":155}