{"text_format":"1","workbook":"xlsx","n_sheets":22,"sheets":["RANKING 2017","CAMPEONES 2018","SUPER CHASQUI","EQUIPOS","ELITE ABIERTA","ELITE JUVENIL","ELITE MENORES","ELITE CABALLOS","AMATEUR ABIERTA","AMATEUR JUVENIL","AMATEUR MENORES","CABALLOS NOVICIOS","BINOMIOS ABIERTA","BINOMIOS LIVIANOS","PR MASTER","PR GENERAL","PR JUVENIL","PR MENORES","PR INFANTIL","PR GENERAL PREMIADA SOCIOS","PR INFANTIL PREMIADA SOCIOS","PR ADULTO-MENOR"],"not_rendered":{"charts":0,"images":0,"macros":1,"external_links":0,"defined_names":151,"comments":0,"pivot_tables":0},"unopened":[],"bounds":{"document_bytes":16777216,"sheet_cells":100000,"rows_first":2000,"rows_last":500,"rows_between":2000,"halvings":0,"cell_chars":16384,"cell_head_chars":4096},"cells_cut":0,"cells_raw":0,"read":"whole","date_system":"1900"}

{"sheet":"RANKING 2017","index":0,"n_rows":120,"n_cols":11,"rows_kept":120,"cut":false,"hidden":false,"merged":[[0,0,0,10],[105,0,105,3],[27,0,27,4],[2,0,2,3],[10,0,10,3],[19,0,19,4],[59,0,59,3],[67,0,67,4],[43,0,43,3],[51,0,51,3],[35,0,35,4],[81,0,81,3],[89,0,89,3],[97,0,97,3],[113,0,113,3],[76,5,76,10],[75,0,75,10]]}
["                                                  RANKING NACIONAL DE ENDURANCE ECUADOR 2018"]
[]
["CATEGORÍA ELITE ABIERTA        "]
[null,null,"JINETE","PUNTAJE"]
[1,"CAMPEÓN NACIONAL",{"$f":"+'ELITE ABIERTA'!D8","v":"ALMEIDA AYALA HECTOR"},{"$f":"+'ELITE ABIERTA'!Q8","v":1160.8}]
[2,"VICECAMPEÓN NACIONAL",{"$f":"+'ELITE ABIERTA'!D9","v":"VINTIMILLA PABLO"},{"$f":"+'ELITE ABIERTA'!Q9","v":1041.95}]
[3,null,{"$f":"+'ELITE ABIERTA'!D10","v":"ANDRADE JOSE DANIEL"},{"$f":"+'ELITE ABIERTA'!Q10","v":1021.6800000000001}]
[4,null,{"$f":"+'ELITE ABIERTA'!D11","v":"WEEMAELS NATHALIE"},{"$f":"+'ELITE ABIERTA'!Q11","v":668.02}]
[5,null,{"$f":"+'ELITE ABIERTA'!D12","v":"LOZADA JOSE ARMANDO"},{"$f":"+'ELITE ABIERTA'!Q12","v":573.66}]
[]
{"$rows_left_out":111}
{"sheet":"CAMPEONES 2018","index":1,"n_rows":57,"n_cols":5,"rows_kept":57,"cut":false,"hidden":false,"merged":[[1,1,1,4],[3,1,3,4],[46,1,46,4],[52,1,52,4],[10,1,10,4],[16,1,16,4],[22,1,22,4],[34,1,34,4],[40,1,40,4],[28,1,28,4]]}
[]
[null,"CAMPEONATO ECUATORIANO DE ENDURANCE"]
[]
[null,"CATEGORÍA ELITE ABIERTA  CHASQUI 3"]
[null,null,null,"JINETE","CABALLO"]
[null,1,"CAMPEÓN NACIONAL","ALMEIDA HECTOR","MARAVILLA"]
[null,2,"VICECAMPEÓN NACIONAL"]
[null,3]
[null,4]
[]
{"$rows_left_out":48}
{"sheet":"SUPER CHASQUI","index":2,"n_rows":115,"n_cols":5,"rows_kept":115,"cut":false,"hidden":true,"merged":[[1,2,1,4],[43,1,43,3],[49,1,49,3],[72,1,72,4],[100,1,100,4],[3,1,3,3],[9,1,9,3],[15,1,15,3],[21,1,21,3],[37,1,37,4]]}
[]
[null,null,"PREMIO SUPER CHASQUI DE ENDURANCE"]
[]
[null,"SUPER CHASQUI 3 JINETES (3000 Km)"]
[null,null,"JINETE"]
[null,1,"ALMEIDA AYALA HECTOR",3732]
[null,2,"ANDRADE JOSE DANIEL",3055]
[null,3]
[]
[null,"SUPER CHASQUI 3 CABALLOS"]
{"$rows_left_out":106}
{"sheet":"EQUIPOS","index":3,"n_rows":35,"n_cols":41,"rows_kept":35,"cut":false,"hidden":false,"merged":[[1,1,1,20],[6,4,6,9],[4,1,4,9],[4,10,4,20],[5,10,5,20],[2,1,2,20]]}
[]
[null,"                                                      PUNTAJE  ACUMULADO"]
[null,"                                                                   EQUIPOS"]
[]
[null,"EQUIPOS",null,null,null,null,null,null,null,null,"PUNTAJES"]
[null,null,null,null,null,null,null,null,null,null,2018]
[null,null,"EQUIPO","CAPITAN","               JINETES",null,null,null,null,null,"II CHONE","III CHONE","V CHONE","VI CHONE","VIII CHONE","XII SÁBADO","XII DOMINGO","X CHONE",null,null,"ACUMULADO"]
[null,1,"SEGUROS EQUINOCCIAL","BERNARDO DARQUEA","MARÍA JOSÉ HERNANDEZ","RICARDO DARQUEA","EMILIO DARQUEA","JUAN JOSÉ RECALDE","GABRIEL DARQUEA","ANDRES DARQUEA",313.44,321.52,null,null,null,null,402.2,null,null,null,{"$f":"SUM(K8:T8)","v":1037.1600000000001}]
[null,2,"SELECT","ARMANDO SERRANO","MANUELA JARAMILLO","JOSÉ DANIEL ANDRADE ","JOSE LETORT MENA","ARMANDO SERRANO","FELIPE ANDRÉS ANDRADE ","BERNARDA LETORT",553.79999999999995,null,null,null,null,null,464,null,null,null,1017.8]
[null,3,"CACHAFAZ ENDURANCE ","ARTURO RIBADENEIRA","MARIA EMILIA BARAHONA","KLARIZA MENDOZA","MARIA CECILIA ALZAMORA","CARLOS DAVALOS","JUAN CARLOS ANDRADE","ARTURO RIBADENEIRA",null,null,null,null,251.2,278.77,285.39999999999998,null,null,null,815.37,null,null,null,null,null,null,null,null,null,null,null,null,null,null,null,null,null,null,{"$f":"+$U$8-U9","v":19.360000000000127},{"$f":"VLOOKUP(B10,#REF!,3,FALSE)","v":{"$error":"#REF!"}}]
{"$rows_left_out":26}
{"sheet":"ELITE ABIERTA","index":4,"n_rows":55,"n_cols":17,"rows_kept":55,"cut":false,"hidden":false,"merged":[[5,4,5,16],[4,1,4,3],[1,1,1,16],[2,1,2,16]]}
[]
[null,"PUNTAJE  ACUMULADO"]
[null,"CATEGORÍA ABIERTA ELITE"]
[]
[null,"ELITE ABIERTA",null,null,"PUNTAJES"]
[null,null,null,null,2018]
[null,null,"CODIGO","JINETE","I CHONE","II CHONE","III CHONE","IV CHONE","V CHONE","VI CHONE","VII CHONE","VIII CHONE","IX CHONE","X CHONE","XI CHONE","XII CHONE","ACUMULADO"]
[null,1,"A045","ALMEIDA AYALA HECTOR",null,324,162,null,null,{"$f":"80.5*2","v":161},136,null,null,null,136,241.8,{"$f":"SUM(E8:P8)","v":1160.8}]
[null,2,"A035","VINTIMILLA PABLO",169.6,233.7,137.69999999999999,null,null,228.95,null,null,null,null,144,128,1041.95]
[null,3,"A248","ANDRADE JOSE DANIEL",135.68,246,null,null,null,null,160,160,null,null,160,160,1021.6800000000001]
{"$rows_left_out":46}
{"sheet":"ELITE JUVENIL","index":5,"n_rows":39,"n_cols":17,"rows_kept":39,"cut":false,"hidden":false,"merged":[[5,4,5,16],[4,1,4,3],[4,4,4,16],[1,1,1,16],[2,1,2,16]]}
[]
[null,"PUNTAJE  ACUMULADO"]
[null,"CATEGORÍA JUVENIL ELITE"]
[]
[null,"ELITE JUVENIL",null,null,"PUNTAJES"]
[null,null,null,null,2018]
[null,null,"CODIGO","JINETE","I CHONE","II CHONE","III CHONE","IV CHONE","V CHONE","VI CHONE","VII CHONE","VIII CHONE","IX CHONE","X CHONE","XI CHONE","XII CHONE","ACUMULADO"]
[null,1,"J063","GONZALEZ BERNARDA",169.6,null,null,null,null,241,160,null,null,null,160,160,{"$f":"SUM(E8:P8)","v":890.6}]
[null,2,"J096","LOYOLA TEODORO ANDRES",127.19999999999999,null,null,128,null,null,152,null,null,null,120,null,527.20000000000005]
[null,3,"J208","MASAPANTA LUIS",null,129.6,65.36,null,null,null,161,null,null,null,null,62.167999999999999,418.12799999999999]
{"$rows_left_out":30}
{"sheet":"ELITE MENORES","index":6,"n_rows":39,"n_cols":15,"rows_kept":39,"cut":false,"hidden":true,"merged":[[1,1,1,14],[2,1,2,14],[4,1,4,3],[4,4,4,14],[5,4,5,14]]}
[]
[null,"PUNTAJE  ACUMULADO"]
[null,"CATEGORÍA MENORES ELITE"]
[]
[null,"ELITE MENORES",null,null,"PUNTAJES"]
[null,null,null,null,2017]
[null,null,"CODIGO","JINETE","I CHONE","II CHONE","III CHONE","IV CHONE","V CHONE","VI CHONE","VII CHONE","VIII CHONE","IX CHONE","X CHONE","ACUMULADO"]
[null,1,null,null,null,null,null,null,null,null,null,null,null,null,{"$f":"SUM(E8:N8)","v":0}]
[null,2,null,null,null,null,null,null,null,null,null,null,null,null,0]
[null,3,null,null,null,null,null,null,null,null,null,null,null,null,0]
{"$rows_left_out":30}
{"sheet":"ELITE CABALLOS","index":7,"n_rows":83,"n_cols":18,"rows_kept":83,"cut":false,"hidden":false,"merged":[[5,5,5,17],[4,5,4,17],[1,1,1,17],[2,1,2,17],[4,1,4,4]]}
[]
[null,"PUNTAJE  ACUMULADO"]
[null,"CATEGORÍA CABALLOS ELITE"]
[]
[null,"ELITE CABALLOS",null,null,null,"PUNTAJES"]
[null,null,null,null,null,2018]
[null,null,"CODIGO","CABALLO","DUEÑO/JINETE","I CHONE","II CHONE","III CHONE","IV CHONE","V CHONE","VI CHONE","VII CHONE","VIII CHONE","IX CHONE","X CHONE","XI CHONE","XII CHONE","ACUMULADO"]
[null,1,"C403","MARAVILLA","HECTOR ALMEIDA AYALA",null,129.6,162,null,null,{"$f":"80.5*2","v":161},null,null,null,null,null,241.8,{"$f":"SUM(H8:Q8)","v":564.79999999999995}]
[null,2,"C417","MANDY CMB","MORABOWEN CESAR",null,null,162,160.19999999999999,null,null,null,null,null,null,120,152,{"$f":"SUM(F9:Q9)-P9","v":474.20000000000005}]
[null,3,"C401","SUMAYA BD","MARIA JOSE HERNANDEZ",null,123.12,129.6,null,null,{"$f":"161*0.95","v":152.94999999999999},null,152,null,null,null,null,{"$f":"SUM(H10:Q10)","v":434.54999999999995}]
{"$rows_left_out":74}
{"sheet":"AMATEUR ABIERTA","index":8,"n_rows":94,"n_cols":17,"rows_kept":94,"cut":false,"hidden":false,"merged":[[5,4,5,16],[4,1,4,3],[4,4,4,16],[1,1,1,16],[2,1,2,16]]}
[]
[null,"PUNTAJE  ACUMULADO"]
[null,"CATEGORÍA ABIERTA NOVICIOS"]
[]
[null,"NOVICIOS ABIERTA",null,null,"PUNTAJES"]
[null,null,null,null,2018]
[null,null,"CODIGO","JINETE","I CHONE","II CHONE","III CHONE","IV CHONE","V CHONE","VI CHONE","VII CHONE","VIII CHONE","IX CHONE","X CHONE","XI CHONE","XII CHONE","ACUMULADO"]
[null,1,"A178","ANDRADE JUAN CARLOS",null,67.2,68.8,null,null,122.36,null,null,null,null,{"$f":"0.8*2*80","v":128},{"$f":"147.24+65.44","v":212.68},{"$f":"SUM(E8:P8)","v":599.04}]
[null,2,"A251","GONZALEZ JERVES XIMENA",80.559999999999988,null,null,null,null,128.80000000000001,115.2,144,null,null,{"$f":"0.8*2*80","v":128},null,596.55999999999995]
[null,3,"A348","MENDOZA KLARIZA",null,null,null,null,null,63.84,null,64,null,null,null,122.2,250.04000000000002]
{"$rows_left_out":85}
{"sheet":"AMATEUR JUVENIL","index":9,"n_rows":83,"n_cols":17,"rows_kept":83,"cut":false,"hidden":false,"merged":[[5,4,5,16],[4,1,4,3],[4,4,4,16],[1,1,1,16],[2,1,2,16]]}
[]
[null,"PUNTAJE  ACUMULADO"]
[null,"CATEGORÍA JUVENIL NOVICIOS"]
[]
[null,"NOVICIOS JUVENIL",null,null,"PUNTAJES"]
[null,null,null,null,2018]
[null,null,"CODIGO","JINETE","I CHONE","II CHONE","III CHONE","IV CHONE","V CHONE","VI CHONE","VII CHONE","VIII CHONE","IX CHONE","X CHONE","XI CHONE","XII CHONE","ACUMULADO"]
[null,1,"J137","DAVALOS JORGE EDUARDO",null,null,129.6,128.16,null,null,null,null,null,null,60.8,65.44,{"$f":"SUM(E8:P8)","v":384}]
[null,2,"J136","SALTOS JUAN XAVIER ",null,null,null,64,null,67.2,115.2,null,null,null,{"$f":"0.8*160","v":128},null,374.4]
[null,3,"J109","LOYOLA LEONARDO",null,null,null,null,null,null,64,64,null,null,64,130.88,322.88]
{"$rows_left_out":74}
{"sheet":"AMATEUR MENORES","index":10,"n_rows":50,"n_cols":17,"rows_kept":50,"cut":false,"hidden":false,"merged":[[5,4,5,16],[4,1,4,3],[4,4,4,16],[1,1,1,16],[2,1,2,16]]}
[]
[null,"PUNTAJE  ACUMULADO"]
[null,"CATEGORÍA MENORES NOVICIOS"]
[]
[null,"INFANTIL",null,null,"PUNTAJES"]
[null,null,null,null,2018]
[null,null,"CODIGO","JINETE","I CHONE","II CHONE","III CHONE","IV CHONE","V CHONE","VI CHONE","VII CHONE","VIII CHONE","IX CHONE","X CHONE","XI CHONE","XII CHONE","ACUMULADO"]
[null,1,"I047","ANDRADE FELIPE ANDRES",135.68,null,null,64,null,128.80000000000001,160,null,null,null,160,{"$f":"65.44+160","v":225.44},{"$f":"SUM(E8:P8)","v":873.92000000000007}]
[null,2,"M086","CARRERA BRUNO",67.84,129.6,null,60.800000000000004,null,122.36,null,null,null,null,null,152,532.6]
[null,3,"M087","CARRERA CAMILA",null,null,null,57.6,null,63.84,128,null,null,null,128,128,505.44]
{"$rows_left_out":41}
{"sheet":"CABALLOS NOVICIOS","index":11,"n_rows":98,"n_cols":20,"rows_kept":98,"cut":false,"hidden":false,"merged":[[5,5,5,17],[4,1,4,4],[4,5,4,17],[1,1,1,17],[2,1,2,17]]}
[]
[null,"PUNTAJE  ACUMULADO"]
[null,"CATEGORÍA CABALLOS NOVICIOS"]
[]
[null,"CABALLOS  NOVICIOS",null,null,null,"PUNTAJES"]
[null,null,null,null,null,2018]
[null,null,"CODIGO","CABALLO","DUEÑO/JINETE","I CHONE","II CHONE","III CHONE","IV CHONE","V CHONE","VI CHONE","VII CHONE","VIII CHONE","IX CHONE","X CHONE","XI CHONE","XII CHONE","ACUMULADO"]
[null,1,"C561","MUNIRAH","FELIPE ANDRADE",null,null,null,64,null,128.80000000000001,160,null,null,null,160,160,{"$f":"SUM(K8:Q8)","v":608.79999999999995}]
[null,2,"C492","BERNARDA","XIMENA GONZALEZ",null,null,null,null,null,128.80000000000001,null,144,null,null,128,null,{"$f":"SUM(F9:Q9)","v":400.8}]
[null,3,"C064","SIMBA","MARIA CONSUELO VELEZ MENA",67.84,null,null,null,null,null,null,160,null,null,160,null,387.84000000000003]
{"$rows_left_out":89}
{"sheet":"BINOMIOS ABIERTA","index":12,"n_rows":165,"n_cols":19,"rows_kept":165,"cut":false,"hidden":false,"merged":[[1,1,1,18],[2,1,2,18],[4,1,4,3],[4,6,4,18],[5,6,5,18]]}
[]
[null,"PUNTAJE  ACUMULADO"]
[null,"CATEGORÍA BINOMIOS ABIERTA"]
[]
[null,"BINOMIOS ABIERTA",null,null,null,null,"PUNTAJES"]
[null,null,null,null,null,null,2018]
[null,null,"CODIGO","JINETE","CODIGO","CABALLO","I CHONE","II CHONE","III CHONE","IV CHONE","V CHONE","VI CHONE","VII CHONE","VIII CHONE","IX CHONE","X CHONE","XI CHONE","XII CHONE","ACUMULADO"]
[null,1,"A059","ALMEIDA AYALA HECTOR ","C410","MARAVILLA",null,null,162,null,null,{"$f":"80.5*2","v":161},null,null,null,null,null,241.8,{"$f":"SUM(G8:R8)","v":564.79999999999995}]
[null,2,"A249","ANDRADE JOSE DANIEL","C072","QUITA PENAS",null,246,null,null,null,null,160,null,null,null,null,null,406]
[null,3,"A309","HERNANDEZ MARÍA JOSÉ ","C393","SUMAYA BD",null,123.12,129.6,null,null,{"$f":"161*0.95","v":152.94999999999999},null,null,null,null,null,null,405.66999999999996]
{"$rows_left_out":156}
{"sheet":"BINOMIOS LIVIANOS","index":13,"n_rows":145,"n_cols":19,"rows_kept":145,"cut":false,"hidden":false,"merged":[[1,1,1,18],[2,1,2,18],[4,1,4,3],[4,6,4,18],[5,6,5,18]]}
[]
[null,"PUNTAJE  ACUMULADO"]
[null,"CATEGORÍA BINOMIOS LIVIANOS"]
[]
[null,"BINOMIOS LIVIANOS",null,null,null,null,"PUNTAJES"]
[null,null,null,null,null,null,2018]
[null,null,"CODIGO","JINETE","CODIGO","CABALLO","I CHONE","II CHONE","III CHONE","IV CHONE","V CHONE","VI CHONE","VII CHONE","VIII CHONE","IX CHONE","X CHONE","XI CHONE","XII CHONE","ACUMULADO"]
[null,1,"M070","ANDRADE FELIPE ANDRES","C561","MUNIRAH",null,null,null,64,null,128.80000000000001,160,null,null,null,160,160,{"$f":"SUM(L8:R8)","v":608.79999999999995}]
[null,2,"J096","LOYOLA TEODORO ANDRES","C278","JUGUETE",127.19999999999999,null,null,128,null,null,152,null,null,null,120,null,{"$f":"SUM(G9:R9)","v":527.20000000000005}]
[null,3,"J063","GONZALEZ BERNARDA ","C382","POLACO",null,null,null,null,null,241,null,null,null,null,160,null,401]
{"$rows_left_out":136}
{"sheet":"PR MASTER","index":14,"n_rows":55,"n_cols":15,"rows_kept":55,"cut":false,"hidden":true,"merged":[[1,1,1,14],[2,1,2,14],[4,1,4,3],[4,4,4,14],[5,4,5,14]]}
[]
[null,"PUNTAJE  ACUMULADO"]
[null,"CATEGORÍA PROMOCIONAL ABIERTA"]
[]
[null,"PROMOCIONAL MASTER",null,null,"PUNTAJES"]
[null,null,null,null,2016]
[null,null,"CODIGO","JINETE","I CHONE","II CHONE","III CHONE","IV CHONE","V CHONE","VI CHONE","VII CHONE","VIII CHONE","IX CHONE","X CHONE","ACUMULADO"]
[null,1,null,null,null,null,null,null,null,null,null,null,null,null,{"$f":"SUM(E8:N8)","v":0}]
[null,2,null,null,null,null,null,null,null,null,null,null,null,null,0]
[null,3,null,null,null,null,null,null,null,null,null,null,null,null,0]
{"$rows_left_out":46}
{"sheet":"PR GENERAL","index":15,"n_rows":69,"n_cols":15,"rows_kept":69,"cut":false,"hidden":false,"merged":[[1,1,1,14],[2,1,2,14],[4,1,4,3],[4,4,4,14],[5,4,5,14]]}
[]
[null,"PUNTAJE  ACUMULADO"]
[null,"CATEGORÍA PROMOCIONAL GENERAL"]
[]
[null,"PROMOCIONAL GENERAL",null,null,"PUNTAJES"]
[null,null,null,null,2018]
[null,null,"CODIGO","JINETE",null,"II CHONE","III CHONE",null,"V CHONE","VI CHONE",null,"VIII CHONE","X CHONE","XII CHONE","ACUMULADO"]
[null,1,"M028","MONCAYO CALERO FERNANDO",null,25.6,58.48,null,58.48,null,null,48.64,null,92.872000000000014,{"$f":"SUM(E8:N8)","v":284.072}]
[null,2,"A164","DÁVALOS CARLOS MANUEL ",null,23.040000000000003,49.536000000000001,null,null,null,null,null,null,62.167999999999999,134.744]
[null,3,"A312","ESTRADA CARLOS",null,null,null,null,68.8,48.384,null,null,null,null,117.184]
{"$rows_left_out":60}
{"sheet":"PR JUVENIL","index":16,"n_rows":50,"n_cols":15,"rows_kept":50,"cut":false,"hidden":true,"merged":[[1,1,1,14],[2,1,2,14],[4,1,4,3],[4,4,4,14],[5,4,5,14]]}
[]
[null,"PUNTAJE  ACUMULADO"]
[null,"CATEGORÍA PROMOCIONAL JUVENIL"]
[]
[null,"PROMOCIONAL JUVENIL",null,null,"PUNTAJES"]
[null,null,null,null,2016]
[null,null,"CODIGO","JINETE","I CHONE","II CHONE","III CHONE","IV CHONE","V CHONE","VI CHONE","VII CHONE","VIII CHONE","IX CHONE","X CHONE","ACUMULADO"]
[null,1,"J105","NOROÑA JORDAN",null,null,null,null,null,null,null,null,68.8,null,{"$f":"SUM(E8:N8)","v":68.8}]
[null,2,"J040","GABRIEL DARQUEA",null,null,null,null,null,null,null,null,null,68.8,68.8]
[null,3,"J116","BARBARA ESPINOZA",null,null,null,null,null,null,null,null,null,65.36,65.36]
{"$rows_left_out":41}
{"sheet":"PR MENORES","index":17,"n_rows":50,"n_cols":15,"rows_kept":50,"cut":false,"hidden":true,"merged":[[1,1,1,14],[2,1,2,14],[4,1,4,3],[4,4,4,14],[5,4,5,14]]}
[]
[null,"PUNTAJE  ACUMULADO"]
[null,"CATEGORÍA PROMOCIONAL MENORES"]
[]
[null,"PROMOCIONAL MENORES",null,null,"PUNTAJES"]
[null,null,null,null,2016]
[null,null,"CODIGO","JINETE","I CHONE","II CHONE","III CHONE","IV CHONE","V CHONE","VI CHONE","VII CHONE","VIII CHONE","IX CHONE","X CHONE","ACUMULADO"]
[null,1,"M028","CORREA JUAN MARTIN",null,null,null,null,null,null,null,null,28.8,32,{"$f":"SUM(E8:N8)","v":60.8}]
[null,2,"M031","ESPINOZA NATALIA",null,null,null,null,58.176000000000002,null,null,null,null,null,{"$f":"SUM(E9:N9)","v":58.176000000000002}]
[null,3,"I019","CASTILLO DAFNE",null,null,null,null,null,null,null,null,32,null,{"$f":"SUM(E10:N10)","v":32}]
{"$rows_left_out":41}
{"sheet":"PR INFANTIL","index":18,"n_rows":50,"n_cols":15,"rows_kept":50,"cut":false,"hidden":false,"merged":[[1,1,1,14],[2,1,2,14],[4,1,4,3],[4,4,4,14],[5,4,5,14]]}
[]
[null,"PUNTAJE  ACUMULADO"]
[null,"CATEGORÍA PROMOCIONAL INFANTIL"]
[]
[null,"PROMOCIONAL INFANTIL",null,null,"PUNTAJES"]
[null,null,null,null,2018]
[null,null,"CODIGO","JINETE","I CHONE","II CHONE","III CHONE","IV CHONE","V CHONE","VI CHONE","VII CHONE","VIII CHONE","X CHONE","XII CHONE","ACUMULADO"]
[null,1,"J068","BARAHONA MARIA EMILIA",null,null,25.6,null,68.8,53.76,null,51.2,null,122.2,{"$f":"SUM(E8:N8)","v":321.56}]
[null,2,"I050","NOBOA JULIAN ",null,null,23.040000000000003,null,32,null,null,25.6,null,null,80.640000000000015]
[null,3,"J207","EMILIO DARQUEA ",null,null,null,null,null,null,null,null,null,65.44,65.44]
{"$rows_left_out":41}
{"sheet":"PR GENERAL PREMIADA SOCIOS","index":19,"n_rows":69,"n_cols":15,"rows_kept":69,"cut":false,"hidden":false,"merged":[[1,1,1,14],[2,1,2,14],[4,1,4,3],[4,4,4,14],[5,4,5,14]]}
[]
[null,"PUNTAJE  ACUMULADO"]
[null,"CATEGORÍA PROMOCIONAL GENERAL"]
[]
[null,"PROMOCIONAL GENERAL",null,null,"PUNTAJES"]
[null,null,null,null,2018]
[null,null,"CODIGO","JINETE",null,"II CHONE","III CHONE",null,"V CHONE","VI CHONE",null,"VIII CHONE","X CHONE","XII CHONE","ACUMULADO"]
[null,1,"M028","MONCAYO CALERO FERNANDO",null,25.6,58.48,null,58.48,null,null,48.64,null,92.872000000000014,{"$f":"SUM(E8:N8)","v":284.072}]
[null,2,"J233","LANAS EMILIO JOSE",null,null,null,null,null,15,null,null,null,65.44,{"$f":"SUM(E9:N9)","v":80.44}]
[null,3,"J234","LANAS JAIME",null,null,null,null,16,null,null,null,null,62.167999999999999,{"$f":"SUM(E10:N10)","v":78.168000000000006}]
{"$rows_left_out":60}
{"sheet":"PR INFANTIL PREMIADA SOCIOS","index":20,"n_rows":50,"n_cols":15,"rows_kept":50,"cut":false,"hidden":false,"merged":[[1,1,1,14],[2,1,2,14],[4,1,4,3],[4,4,4,14],[5,4,5,14]]}
[]
[null,"PUNTAJE  ACUMULADO"]
[null,"CATEGORÍA PROMOCIONAL INFANTIL"]
[]
[null,"PROMOCIONAL INFANTIL",null,null,"PUNTAJES"]
[null,null,null,null,2018]
[null,null,"CODIGO","JINETE","I CHONE","II CHONE","III CHONE","IV CHONE","V CHONE","VI CHONE","VII CHONE","VIII CHONE","X CHONE","XII CHONE","ACUMULADO"]
[null,1,"J068","BARAHONA MARIA EMILIA",null,null,25.6,null,68.8,53.76,null,51.2,null,122.2,{"$f":"SUM(E8:N8)","v":321.56}]
[null,2,"J207","EMILIO DARQUEA ",null,null,null,null,null,null,null,null,null,65.44,{"$f":"SUM(E9:N9)","v":65.44}]
[null,3,null,null,null,null,null,null,null,null,null,null,null,null,{"$f":"SUM(E10:N10)","v":0}]
{"$rows_left_out":41}
{"sheet":"PR ADULTO-MENOR","index":21,"n_rows":165,"n_cols":15,"rows_kept":165,"cut":false,"hidden":true,"merged":[[1,1,1,14],[2,1,2,14],[4,1,4,2],[4,4,4,14],[5,4,5,14]]}
[]
[null,"PUNTAJE  ACUMULADO"]
[null,"CATEGORÍA PROMOCIONAL ADULTO/MENOR"]
[]
[null,"BINOMIOS ABIERTA",null,null,"PUNTAJES"]
[null,null,null,null,2016]
[null,null,"MENOR","ADULTOS","I CHONE","II CHONE","III CHONE","IV CHONE","V CHONE","VI CHONE","VII CHONE","VIII CHONE","IX CHONE","X CHONE","ACUMULADO"]
[null,1,"CASTILLO DAFNE",null,null,null,null,null,null,null,null,null,null,null,64.64]
[null,2,"SERRANO OLIVIA",null,32.480000000000004,null,null,null,30.703999999999997,null,null,null,null,null,{"$f":"SUM(E9:N9)","v":63.183999999999997}]
[null,3,"JARA RAFAELA",null,null,null,null,null,32.32,null,null,null,null,null,32.32]
{"$rows_left_out":155}